program: Gaussian 09
title: 000146038
version: EM64L-G09RevD.01
frameworkgroup: C1[X(C17H20N3O2)]
method: RPBEPBE
basis: SDD
operation: Freq
keyword: #p
keyword: freq=noraman
keyword: PBEPBE/SDD
title: #p freq=noraman PBEPBE/SDD
converged: YES YES NO NO
title: Mulliken charges:
elementType: O O N N N C C C C C C C C C C C C C C C C C H H H H H H H H H H H H H H H H H H H H
charge: -0.193392 -0.184398 -0.262198 -0.391088 -0.349970 0.145012 0.144399 0.297668 0.297101 -0.489142 -0.489050 -0.541136 -0.540845 -0.423776 -0.423662 -0.415887 -0.416242 -0.394225 0.225605 0.127383 -0.210905 0.184260 0.250738 0.274681 0.274157 0.250695 0.256729 0.252573 0.252780 0.256685 0.244086 0.235115 0.235004 0.244046 0.246691 0.219257 0.219324 0.246848 0.277659 0.294958 0.391776 0.380686
chargesum: 1.00000
title: Mulliken charges with hydrogens summed into heavy atoms:
elementType: O O N N N C C C C C C C C C C C C C C C C C
charge: -0.193392 -0.184398 -0.262198 0.000688 0.030716 0.145012 0.144399 0.297668 0.297101 0.036277 0.035802 -0.031834 -0.031381 0.055425 0.055388 0.050061 0.049929 -0.116566 0.225605 0.127383 0.084053 0.184260
polarizability: 2.52074689e+02 8.59786449e-02 2.14333501e+02 -1.20352879e+01 -1.56915236e-01 1.48073237e+02
1716.lowfreq: -17.1637 -6.8009 -0.0007 0.0003 0.0006 1.5690 31.9587 44.9584 48.8112
frequency: 31.8682 44.9548 48.6959 61.5692 78.2216 94.4857 131.4379 143.7590 163.3821 174.3072 187.5757 276.3265 290.4656 294.7738 316.9574 347.1916 357.1266 358.6407 371.0032 401.0644 418.8204 460.8810 479.2302 500.5674 502.5500 510.5381 541.5307 589.2859 589.9471 613.2470 641.1154 657.4994 681.3035 705.1370 718.0037 732.2191 739.9758 776.9118 792.4762 815.4452 823.4582 834.4494 870.0370 884.2337 890.4994 894.9227 922.4279 929.8059 931.7771 937.2536 966.4455 976.5995 1002.6910 1082.8956 1084.5830 1093.4384 1105.0249 1118.3472 1119.1034 1143.3787 1145.1953 1169.9866 1174.5900 1175.4000 1190.4259 1233.1347 1243.0616 1249.2870 1249.6502 1256.1799 1270.8670 1285.5649 1287.0348 1298.4649 1322.4572 1323.3058 1338.6542 1339.1125 1349.6852 1352.2552 1362.9487 1364.4009 1369.2417 1378.6016 1396.5174 1425.3063 1432.6852 1446.8990 1449.8261 1459.3320 1477.2969 1478.1860 1479.6724 1480.0891 1487.0391 1583.5582 1591.4250 1620.0623 1660.0677 1705.7641 2968.2938 2968.5985 2979.1254 2979.4798 2995.4433 2995.6898 3005.8190 3005.9453 3040.8793 3041.7072 3043.0250 3044.2614 3071.3033 3071.5337 3076.1133 3076.3473 3129.4393 3166.5538 3504.8678 3541.6816
redmass: 7.7059 3.4935 6.3644 3.3286 2.5616 2.2143 6.0683 3.4114 8.1151 4.5924 2.6265 3.7913 2.8932 1.7104 2.7970 2.7268 3.1075 4.9020 10.8328 3.7549 3.5654 3.3152 2.5104 3.3395 3.5157 8.1314 5.1690 5.0216 3.7463 5.1009 2.4373 1.5241 2.8348 2.1299 3.6962 3.4571 7.3776 2.7573 2.5772 2.6824 1.5666 2.1931 2.4354 1.5782 2.1918 1.6775 3.0591 2.1048 3.2651 1.4700 1.3982 2.8252 2.2309 1.9750 1.9655 2.4749 1.9957 3.3992 2.2976 1.1511 1.1708 3.0666 1.3821 1.4458 3.0985 1.4097 2.7346 1.2713 1.2753 1.5334 1.4421 3.1294 2.4550 1.5051 2.3379 1.4838 1.4512 1.6198 1.3813 1.4889 1.5314 1.7633 2.4927 1.5663 3.6061 1.2820 1.1415 1.1268 1.0947 2.3725 1.0997 1.0868 1.0858 1.0866 2.4493 6.1214 6.6114 6.4582 6.6639 6.1399 1.0660 1.0660 1.0643 1.0643 1.0669 1.0669 1.0630 1.0630 1.0959 1.0954 1.0930 1.0926 1.0972 1.0972 1.1033 1.1033 1.0925 1.0962 1.0775 1.0796
irintensity: 2.5559 0.6145 2.3497 0.2454 0.0997 0.0374 0.7016 4.6276 4.0395 0.1802 1.2868 1.6124 1.5243 0.2580 2.5998 0.1275 0.3372 0.0281 21.6786 1.8071 8.2292 3.0011 3.3990 2.5184 0.3732 12.9644 9.4553 16.4171 0.1882 0.3347 0.7774 62.5285 2.0981 0.1827 5.1506 23.3875 2.8351 38.8066 115.1956 0.4726 27.0833 2.6241 1.2105 5.8541 2.9061 0.3765 11.3302 0.1043 0.8781 9.0788 16.0524 0.1334 2.7799 0.2020 0.0625 0.2023 1.3744 12.0439 0.0448 0.0360 0.5476 64.0771 0.2019 6.0695 28.1236 0.3806 0.9817 3.5682 2.5151 4.9054 1.4802 10.8322 137.0597 3.8866 15.9035 0.0154 8.2542 1.4779 0.7091 1.6514 0.2927 23.8732 51.5938 5.0844 0.6086 29.1913 16.3026 9.1761 28.7000 55.2816 12.9976 22.4458 17.2514 9.6587 126.4727 0.1034 31.3807 86.5185 226.7633 762.7426 5.1505 21.1976 1.6170 12.4009 22.4416 18.5070 12.4769 27.0534 12.7452 21.3852 0.0453 13.1562 43.3988 11.6240 15.3708 29.7451 2.3496 2.1621 99.9068 152.9165
temp: 298.150 k
press: 1.00000 atm
elementType: 8 8 7 7 7 6 6 6 6 6 6 6 6 6 6 6 6 6 6 6 6 6 1 1 1 1 1 1 1 1 1 1 1 1 1 1 1 1 1 1 1 1
symmnumber: 1
zpe: 914313.0 jmol-1
zpe.correction: 0.348243 hartree
zpe.thermalcorrener: 0.366931 hartree
zpe.thermalcorrenthalpy: 0.367875 hartree
zpe.thermalcorrgfe: 0.300797 hartree
zpe.sumelectzpe: -972.748033 hartree
zpe.sumelectthermal: -972.729346 hartree
zpe.sumelectthermalent: -972.728401 hartree
zpe.sumelectthermalfe: -972.795479 hartree
dipole: -4.2571 0.0442 -4.4511
dipole: 6.1594
quadrupole: -104.2120 -93.4373 -119.5007
quadrupole: 0.0550 -6.1805 0.0257
quadrupole: 1.5047 12.2793 -13.7840 0.0550 -6.1805 0.0257
hfenergy: -973.0962767 hartree
pointgroup: C01 [X(C17H20N3O2)]
dipole: 1.6877302 0.0648283 1.7377129 debye
polarizability: 251.8699147|0.5720282|214.3398041|-12.8458938|-0.6119213|148.2717085 unknown
InChI: InChI=1S/C17H20N3O2/c21-16-15(10-18-17(22)19-16)20-13-7-3-1-5-11(13)9-12-6-2-4-8-14(12)20/h9-10,18-19H,1-8H2
charge 1 multiplicity 1
42 atoms
O  -1.361859 -0.0677 -2.204314
O  -5.331419 -0.115567 0.312225
N  0.245184 0.007271 0.166288
N  -3.334319 -0.092591 -0.933013
N  -3.270463 -0.057812 1.430533
C  0.932718 -1.208124 0.109139
C  0.869134 1.255673 0.090967
C  2.345294 -1.179314 0.035757
C  2.2812 1.299686 0.018485
C  0.140001 -2.500286 0.140535
C  0.010814 2.505466 0.100013
C  3.160585 -2.463714 -0.013608
C  3.029386 2.62376 -0.050524
C  0.989252 -3.726353 -0.270935
C  0.794803 3.763419 -0.342051
C  2.363685 -3.708458 0.427308
C  2.16638 3.835385 0.358106
C  2.98833 0.077396 -0.002449
C  -1.209018 -0.029042 0.21526
C  -1.923129 -0.063433 -1.076023
C  -1.893307 -0.027305 1.407529
C  -4.085635 -0.091458 0.259653
H  -0.256533 -2.655053 1.165611
H  -0.741169 -2.420192 -0.521439
H  -0.868219 2.366766 -0.554987
H  -0.388056 2.662339 1.123845
H  3.516559 -2.606383 -1.054095
H  4.068095 -2.339856 0.606015
H  3.93669 2.559154 0.578585
H  3.387141 2.762901 -1.090861
H  0.431218 -4.643736 -0.014751
H  1.128206 -3.731196 -1.368841
H  0.935523 3.747829 -1.439615
H  0.189375 4.656574 -0.109096
H  2.93403 -4.619284 0.175728
H  2.228414 -3.708345 1.526692
H  2.027854 3.854798 1.456932
H  2.689163 4.768396 0.085541
H  4.083889 0.105336 -0.055296
H  -1.38295 -0.001633 2.374784
H  -3.88235 -0.1163 -1.801495
H  -3.788396 -0.056516 2.313562
