program: Gaussian 09
title: 000146027
version: EM64L-G09RevD.01
frameworkgroup: C1[X(C16H11NO4)]
method: RPBEPBE
basis: SDD
operation: Freq
keyword: #p
keyword: freq=noraman
keyword: PBEPBE/SDD
title: #p freq=noraman PBEPBE/SDD
converged: YES YES NO NO
title: Mulliken charges:
elementType: O O O O N C C C C C C C C C C C C C C C C H H H H H H H H H H H
charge: -0.373373 -0.297899 -0.327400 -0.248628 -0.445880 0.067978 0.114802 0.290698 0.302288 -0.134492 0.310845 -0.081749 0.080574 -0.318926 -0.356110 -0.383089 -0.374519 -0.223817 -0.224602 0.208376 -0.785461 0.321890 0.268199 0.295427 0.295575 0.388616 0.242276 0.243123 0.392330 0.245990 0.262574 0.244383
chargesum: 0.00000
title: Mulliken charges with hydrogens summed into heavy atoms:
elementType: O O O O N C C C C C C C C C C C C C C C C
charge: 0.018957 -0.297899 -0.327400 -0.248628 -0.057264 0.067978 0.114802 0.290698 0.302288 -0.134492 0.310845 -0.081749 0.080574 0.002964 -0.087910 -0.087662 -0.078944 0.018458 0.018521 0.208376 -0.032514
polarizability: 3.51455183e+02 2.50630221e+01 2.52401556e+02 2.19757502e-02 -4.65204333e-02 7.71570445e+01
1716.lowfreq: -56.7673 -5.5990 0.0007 0.0008 0.0010 3.8312 8.4789 44.4572 59.9464
frequency: -56.7641 44.4563 59.9394 84.4164 106.3373 119.5239 155.1839 176.3000 188.0815 217.9316 254.6612 258.3452 299.3119 346.2889 368.4926 389.7161 405.3445 421.7620 427.3525 434.0947 461.7656 483.7067 497.6727 513.5228 567.9579 575.9040 591.2100 633.8527 657.8513 665.2853 708.4455 719.3390 739.1914 763.8234 804.7744 844.1228 845.2764 860.0455 869.3758 915.9430 931.6629 962.9252 976.2651 988.1853 998.6245 999.0097 1009.5600 1016.3697 1026.2361 1035.9468 1069.5888 1087.4296 1165.3426 1166.3697 1176.3633 1229.1576 1246.9022 1263.7206 1277.1623 1296.8446 1309.7498 1357.3593 1379.2857 1388.5996 1396.8787 1405.9880 1435.7710 1450.5336 1453.5755 1463.4688 1469.5763 1491.9512 1518.7958 1565.1806 1584.1559 1588.5355 1608.4456 1620.6585 1641.4455 2577.4779 2992.4220 3077.2575 3080.9463 3138.3227 3139.1882 3155.3727 3167.8989 3169.0817 3175.6468 3188.6567
redmass: 1.0556 8.2428 4.3399 4.9908 5.3459 4.6022 7.6142 5.6387 7.4416 5.7220 6.4546 7.7605 4.7798 5.8388 5.0013 7.9781 9.9833 3.4893 5.7563 12.1049 7.2961 5.6263 4.7164 6.1162 3.5319 6.1249 3.1891 6.5706 6.9281 4.8447 6.6175 3.2239 4.1705 6.2894 1.7317 5.5422 3.2884 1.5558 7.8993 5.6845 1.6944 4.2907 1.1062 1.0652 2.1021 1.3883 1.3099 1.3680 2.4363 1.6644 2.1843 2.5072 1.3603 2.2590 1.1992 2.9911 1.6513 2.1239 2.3948 3.0713 5.5309 3.7145 1.2514 4.6597 7.0737 8.3900 4.3930 1.1641 2.8642 1.0465 2.6567 3.5924 8.5895 3.1872 3.7172 3.2784 6.4483 7.0902 2.7789 1.0741 1.0381 1.0978 1.0849 1.0990 1.0866 1.0908 1.0946 1.0901 1.0998 1.0971
irintensity: 0.8975 0.0816 0.0742 10.2243 1.3207 3.2779 1.1671 0.0100 0.0416 1.9689 0.1211 0.3999 3.8148 6.2431 0.0294 2.7202 2.4139 1.8255 0.1696 16.9091 9.5087 1.7186 0.0753 27.7358 18.2411 3.3362 3.9003 0.3951 7.2467 0.1678 10.3243 22.3891 6.0097 3.7938 49.3322 1.0067 3.7544 57.0485 16.0773 5.6044 0.0110 9.9273 62.8543 129.9820 78.4337 10.6380 3.9581 0.0192 10.5379 18.4217 6.6765 6.0685 25.7344 9.6274 47.4831 127.2775 77.7748 173.4824 187.0064 156.1645 589.6930 70.2154 34.4023 119.1936 34.9266 54.6498 60.6518 61.7438 10.3483 19.3089 122.1419 444.4970 179.8125 285.3272 155.6586 170.6986 1.3659 23.8991 34.8443 99.3654 2.8719 10.4459 92.8691 11.0815 3.8045 10.0665 0.8677 5.3028 24.8833 13.0241
temp: 298.150 k
press: 1.00000 atm
elementType: 8 8 8 8 7 6 6 6 6 6 6 6 6 6 6 6 6 6 6 6 6 1 1 1 1 1 1 1 1 1 1 1
symmnumber: 1
zpe: 612443.1 jmol-1
zpe.correction: 0.233267 hartree
zpe.thermalcorrener: 0.249147 hartree
zpe.thermalcorrenthalpy: 0.250091 hartree
zpe.thermalcorrgfe: 0.189960 hartree
zpe.sumelectzpe: -970.571731 hartree
zpe.sumelectthermal: -970.555852 hartree
zpe.sumelectthermalent: -970.554907 hartree
zpe.sumelectthermalfe: -970.615039 hartree
dipole: -2.4099 -3.7481 0.0137
dipole: 4.4560
quadrupole: -116.0946 -119.8036 -122.6118
quadrupole: 3.9286 0.0304 0.0078
quadrupole: 3.4087 -0.3003 -3.1085 3.9286 0.0304 0.0078
hfenergy: -970.8049982 hartree
pointgroup: C01 [X(C16H11N1O4)]
dipole: -1.0496679 1.4041428 -0.0050063 debye
polarizability: 354.486581|-17.8520219|249.3701718|0.0101272|0.0133227|77.1570306 unknown
InChI: InChI=1S/C16H11NO4/c1-8(18)17-11-6-7-12(19)14-13(11)15(20)9-4-2-3-5-10(9)16(14)21/h2-7,17,19H,1H3
charge 0 multiplicity 1
32 atoms
O  -0.153298 -3.796589 -0.003242
O  0.345569 2.320298 0.00097
O  -2.307459 -2.534683 0.000895
O  4.893755 0.397116 0.003691
N  2.637094 1.091156 0.003168
C  0.50557 -0.102189 0.001402
C  -0.216501 -1.349155 0.000213
C  -1.734087 1.119058 0.001274
C  -2.433094 -0.12443 0.00053
C  -0.246681 1.168344 0.002342
C  1.940936 -0.125886 0.001666
C  -1.678012 -1.392376 0.000339
C  0.493832 -2.593291 -0.001079
C  2.628214 -1.390054 0.000702
C  1.920238 -2.588841 -0.000672
C  -2.468713 2.331345 0.001205
C  -3.850383 -0.141991 -0.000042
C  -3.877122 2.307178 0.000553
C  -4.570111 1.068259 -0.000043
C  4.024314 1.316148 0.002942
C  4.388171 2.796847 -0.0011
H  3.719882 -1.381005 0.001219
H  2.439098 -3.551625 -0.00162
H  -1.911904 3.273018 0.001809
H  -4.357132 -1.111663 -0.000568
H  1.98834 1.914284 0.004658
H  -4.43966 3.246781 0.000562
H  -5.665068 1.054485 -0.000542
H  -1.180555 -3.583237 -0.004975
H  4.008509 3.293777 -0.912816
H  5.482571 2.894344 0.031977
H  3.950185 3.31718 0.870283
