program: Gaussian 09
title: 000146025
version: EM64L-G09RevD.01
frameworkgroup: C1[X(C12H15N2O4)]
method: RPBEPBE
basis: SDD
operation: Freq
keyword: #p
keyword: freq=noraman
keyword: PBEPBE/SDD
title: #p freq=noraman PBEPBE/SDD
converged: YES YES NO NO
title: Mulliken charges:
elementType: O O O O N N C C C C C C C C C C C C H H H H H H H H H H H H H H H
charge: -0.146735 -0.292807 -0.261914 -0.080924 0.035240 -0.095941 -0.579585 -0.399705 0.556195 -0.503461 -0.393873 0.230869 0.200415 -0.320358 -0.175329 0.202529 -0.527483 -0.529292 0.255400 0.228570 0.298943 0.283089 0.261860 0.246950 0.276733 0.338141 0.371582 0.233015 0.256272 0.258443 0.248821 0.266892 0.257450
chargesum: 1.00000
title: Mulliken charges with hydrogens summed into heavy atoms:
elementType: O O O O N N C C C C C C C C C C C C
charge: -0.146735 -0.292807 -0.261914 -0.080924 0.035240 0.275641 -0.095615 0.182327 0.556195 -0.241601 -0.146923 0.230869 0.200415 -0.043625 0.162812 0.202529 0.220247 0.243872
polarizability: 6.43979077e+02 8.90084640e+00 1.51345888e+02 1.11253600e+01 -1.07106748e+01 9.45052817e+01
1716.lowfreq: -12.1616 -6.6425 -0.0006 0.0004 0.0007 2.1736 8.6149 26.3761 35.5016
frequency: -4.7633 26.3360 35.4112 51.7279 71.7116 94.6824 98.1204 123.5840 147.7895 162.3784 173.7643 200.2038 228.8704 262.4960 272.6377 291.9257 318.2690 353.3138 382.8347 414.8406 438.3363 468.2211 480.4735 496.7066 522.4589 573.2247 606.0929 610.4029 629.3775 652.8764 700.5374 727.6431 738.7255 753.7343 775.9545 787.8025 835.0421 876.3440 891.4648 929.3129 935.3851 951.8666 964.1345 971.7549 1012.2633 1032.3356 1068.1328 1095.7214 1103.3876 1109.4136 1110.0918 1144.4060 1154.5103 1159.6675 1168.3745 1213.6472 1249.1986 1254.9293 1273.7761 1293.4639 1303.4948 1324.5926 1351.8742 1369.3772 1407.6486 1429.5953 1448.5175 1456.7262 1457.9997 1463.6934 1469.3868 1470.8521 1479.0142 1483.4277 1522.9336 1544.2081 1603.9627 1791.0836 2989.4063 2992.1487 3001.7262 3048.0589 3064.5491 3089.3668 3107.7223 3124.0621 3134.1108 3137.1040 3145.1020 3152.2131 3175.8946 3255.8613 3380.5040
redmass: 5.6736 5.4487 4.5546 3.7429 4.1134 2.2671 2.3159 1.9360 2.0690 1.3220 2.9550 5.2563 4.5925 5.6506 2.6837 4.2529 3.8059 4.5698 4.4566 4.6178 3.7401 3.5760 3.4191 5.3184 6.6821 4.8183 5.6474 3.5829 4.2904 4.8198 5.9263 5.3462 3.9292 4.0960 1.4927 1.2598 1.5033 5.8311 1.5430 8.3356 5.0172 3.3305 1.6530 3.0441 2.1263 2.8721 4.2456 2.4668 2.0334 1.2604 1.3483 1.4031 1.3402 1.6419 1.2054 1.8794 1.4659 2.1712 1.6589 1.5096 1.3019 1.1836 1.5660 5.1423 2.1298 1.2283 1.4537 1.1303 1.0740 1.0656 1.0700 1.1085 2.1673 1.1758 3.9924 6.0411 6.2410 12.4587 1.0306 1.0613 1.0301 1.0608 1.1009 1.1052 1.1045 1.1082 1.0910 1.0916 1.1034 1.1052 1.0956 1.0996 1.0808
irintensity: 0.1912 1.5985 0.1857 7.4987 11.7869 5.3836 5.0821 0.8222 22.7995 1.4165 19.5400 0.5208 39.3403 25.0100 0.7151 0.5505 0.8555 1.2968 33.6575 66.2415 145.6836 54.0917 7.1213 21.0636 62.4442 11.6925 12.7725 229.9810 21.4440 34.9220 0.5876 39.4100 49.2076 42.7001 27.3843 19.0430 39.0875 18.4646 30.1770 135.6494 3.6227 11.3482 6.1400 54.5325 16.2483 26.8332 115.6659 169.8462 158.0060 21.1949 54.4071 1.6974 9.2868 15.6386 112.5660 15.4857 123.7624 415.8934 206.1054 85.3256 120.9785 23.2551 27.7028 27.1806 17.9689 19.4211 29.6036 20.3655 17.3848 11.6860 24.3533 46.1506 377.3353 1.7619 640.6427 15.1530 64.1693 1446.2599 61.8039 11.7712 77.6839 1.0404 5.7656 19.8505 23.5127 0.0925 4.8990 1.6889 11.0833 8.7554 2.6655 67.4542 60.9680
temp: 298.150 k
press: 1.00000 atm
elementType: 8 8 8 8 7 7 6 6 6 6 6 6 6 6 6 6 6 6 1 1 1 1 1 1 1 1 1 1 1 1 1 1 1
symmnumber: 1
zpe: 673786.5 jmol-1
zpe.correction: 0.256632 hartree
zpe.thermalcorrener: 0.274084 hartree
zpe.thermalcorrenthalpy: 0.275028 hartree
zpe.thermalcorrgfe: 0.209890 hartree
zpe.sumelectzpe: -874.938167 hartree
zpe.sumelectthermal: -874.920715 hartree
zpe.sumelectthermalent: -874.919771 hartree
zpe.sumelectthermalfe: -874.984908 hartree
dipole: 1.4640 0.2258 0.7538
dipole: 1.6620
quadrupole: -58.9697 -91.8617 -97.8045
quadrupole: -3.8463 2.0097 -0.0619
quadrupole: 23.9089 -8.9831 -14.9259 -3.8463 2.0097 -0.0619
hfenergy: -875.1947984 hartree
pointgroup: C01 [X(C12H15N2O4)]
dipole: -0.5787679 -0.104226 0.2859171 debye
polarizability: 644.2317352|1.5639194|148.9272945|-8.1706235|15.5517011|96.6712169 unknown
InChI: InChI=1S/C12H15N2O4/c1-16-10-4-3-9(7-11(10)17-2)5-6-14-8-12(15)18-13-14/h3-4,7-8,13H,5-6H2,1-2H3
charge 1 multiplicity 1
33 atoms
O  -5.115766 -0.865252 -0.734958
O  3.50504 -1.70738 -0.375289
O  4.659677 0.912618 0.439353
O  -6.557719 0.805136 0.243644
N  -3.182368 -0.186672 0.295296
N  -3.747264 -1.201931 -0.496549
C  -0.946136 0.427567 -0.742392
C  -1.714309 -0.163894 0.499775
C  0.530275 0.523629 -0.423839
C  1.37085 -0.611172 -0.544368
C  1.083663 1.743569 0.060149
C  2.742654 -0.540683 -0.230879
C  3.31039 0.719847 0.165982
C  2.455416 1.837215 0.348144
C  -4.123367 0.660457 0.740127
C  -5.425344 0.354582 0.165075
C  4.179555 -2.209371 0.855095
C  5.663639 0.472319 -0.573445
H  -1.363961 1.423731 -0.973124
H  -1.112718 -0.228125 -1.618966
H  -1.386426 -1.197302 0.702187
H  -1.52211 0.447766 1.395336
H  0.987372 -1.579322 -0.888303
H  0.450045 2.631715 0.167376
H  2.908936 2.777863 0.673763
H  -3.917387 1.445777 1.462671
H  -3.248647 -1.425917 -1.377802
H  3.417994 -2.555932 1.576438
H  4.81032 -1.43053 1.317884
H  4.794662 -3.055632 0.51879
H  5.652733 1.194625 -1.408155
H  5.450135 -0.542902 -0.944355
H  6.629668 0.5118 -0.051663
