program: Gaussian 09
title: 000146407
version: EM64L-G09RevD.01
frameworkgroup: C1[X(C23H23N6O7P)]
method: RPBEPBE
basis: SDD
operation: Freq
keyword: #p
keyword: freq=noraman
keyword: PBEPBE/SDD
title: #p freq=noraman PBEPBE/SDD
converged: YES YES NO NO
title: Mulliken charges:
elementType: P O O O O O O O N N N N N N C C C C C C C C C C C C C C C C C C C C C C C H H H H H H H H H H H H H H H H H H H H H H H
charge: 1.391963 -0.281059 -0.422723 -0.616572 -0.203610 -0.729927 -0.680602 -0.596543 -0.289176 -0.482905 -0.075430 -0.397236 -0.029162 -0.736539 -0.108208 -0.508470 -0.146338 -0.131341 -0.274333 0.346005 0.178525 -0.099663 0.487065 0.310110 0.183072 -0.695177 0.185693 0.273308 -0.544583 -0.001949 0.073893 -0.511002 -0.390802 -0.398329 -0.423025 -0.235498 -0.238490 0.274471 0.262873 0.257248 0.268332 0.292674 0.247779 0.255494 0.359481 0.324627 0.443997 0.252805 0.250758 0.343189 0.212923 0.239498 0.234615 0.242627 0.224013 0.224817 0.383335 0.360296 0.467150 0.396057
chargesum: 0.00000
title: Mulliken charges with hydrogens summed into heavy atoms:
elementType: P O O O O O O O N N N N N N C C C C C C C C C C C C C C C C C C C C C C C
charge: 1.391963 -0.281059 -0.063242 -0.616572 -0.203610 -0.262777 -0.284545 -0.596543 -0.289176 -0.158278 -0.075430 0.046761 -0.029162 0.007092 0.166263 0.011650 0.121993 0.161332 0.228941 0.346005 0.178525 -0.099663 0.487065 0.310110 0.183072 -0.191613 0.185693 0.273308 -0.201394 -0.001949 0.073893 -0.298080 -0.151303 -0.163713 -0.180398 -0.011485 -0.013673
polarizability: 6.06581050e+02 -6.42746166e+00 3.69334666e+02 -1.70851043e+01 4.40125865e+00 1.79699622e+02
1716.lowfreq: -9.7672 -3.0540 -0.0013 0.0004 0.0013 3.5047 10.9725 20.6477 25.0307
frequency: 7.9374 20.5974 24.9929 35.9835 39.6547 46.8521 62.4132 71.5313 79.6125 89.8118 114.6316 119.0002 125.4572 136.7406 139.6047 154.2315 166.6958 175.7878 186.0633 206.4111 212.6762 234.7380 239.2941 240.4555 257.4870 271.1683 287.3489 289.7115 303.1842 317.5844 332.0667 336.5174 342.3240 359.5770 369.6765 378.9428 390.6759 406.2378 416.3411 421.3724 437.1956 438.7026 455.1275 460.5224 472.7482 497.1739 505.9879 511.4396 514.2798 532.2837 547.2388 584.2236 592.2896 610.3440 621.3856 629.9247 635.0005 638.5154 660.4767 676.3826 681.4572 694.9809 707.0852 715.5108 737.5481 742.8280 749.2651 767.3994 770.3191 776.3195 781.5206 802.2227 814.8210 822.4026 825.8090 853.8788 864.5970 869.1945 888.3707 913.6909 917.3417 937.1386 940.6452 944.5719 948.6800 962.6650 972.7725 979.8153 985.3310 994.0180 997.7643 1008.7499 1016.7872 1025.2365 1029.2583 1041.3665 1054.1298 1064.1043 1074.8085 1093.9387 1097.3187 1104.2109 1130.7107 1133.4001 1138.7024 1153.3752 1162.2359 1168.4760 1188.1153 1194.7760 1203.7755 1207.3974 1224.9109 1229.9942 1239.3947 1248.1665 1269.5554 1275.1477 1281.3987 1293.8469 1301.7479 1305.5226 1309.9358 1325.7595 1338.2310 1350.2696 1372.0493 1375.8228 1381.4885 1389.4074 1399.0522 1422.1223 1426.4052 1445.2352 1450.4841 1456.8402 1461.2852 1468.7575 1480.1306 1491.3681 1503.6318 1518.5169 1541.2303 1561.8462 1588.1435 1590.3533 1602.2612 1618.1574 1621.4841 1627.1407 1629.7212 1639.5337 2981.1491 2986.6438 2987.7050 3024.3033 3030.6702 3051.5754 3086.0174 3089.8809 3096.4235 3100.6477 3120.2294 3127.3824 3140.8505 3144.6000 3155.2425 3160.1940 3162.7899 3372.7283 3479.4472 3544.7206 3565.1399 3600.4200
redmass: 8.1238 5.4053 6.2931 6.6301 7.4111 4.5815 8.7600 6.1758 6.8003 6.2485 6.4981 5.4432 4.4728 4.7321 5.1174 7.4021 6.6992 7.3651 5.1501 4.4084 7.1820 2.1277 2.3199 3.7715 4.9640 6.8229 5.6201 3.7433 3.4366 3.6789 1.6451 2.8247 3.1378 5.2585 8.4497 5.1421 7.5613 4.8699 6.1443 2.4853 1.8267 2.7684 2.4748 1.4641 3.5812 5.3059 4.3428 3.1480 3.7323 4.9327 6.1255 5.7359 2.9810 5.3201 6.0647 6.5483 10.2628 6.0474 6.3289 9.8315 9.5962 6.0680 2.8987 4.9226 5.2664 1.6355 3.8561 9.7534 5.0405 2.1427 2.3175 3.7442 1.6317 3.2525 4.0661 3.1497 4.7923 1.3657 5.1397 1.6577 4.3508 1.3921 3.8021 2.6263 1.3842 5.9789 3.3716 1.6144 1.4095 6.0713 1.3712 2.5708 3.6595 2.1752 3.2693 3.3802 2.5211 4.1569 2.0398 3.5523 2.0884 4.2473 1.8795 1.1571 1.5387 1.5511 1.3100 1.1379 1.7627 1.4139 2.0067 2.7525 1.2460 1.8479 1.7469 2.7136 1.4649 2.2454 2.3532 1.4004 1.5379 1.4482 2.2229 2.5307 1.2129 2.4218 1.2943 4.8314 1.2704 3.8398 1.5564 1.2998 1.1860 2.7350 1.0984 3.9142 2.6841 1.1342 1.4200 3.5741 1.1041 1.8029 5.8247 3.3335 6.2737 6.6666 5.6883 2.5782 7.1929 1.6725 3.1632 4.9294 1.0869 1.0613 1.0567 1.0601 1.0990 1.1051 1.0896 1.0904 1.1033 1.0887 1.0851 1.0895 1.0947 1.0949 1.0873 1.1003 1.0942 1.0481 1.0917 1.0663 1.0754 1.0663
irintensity: 0.1151 0.4700 1.8030 0.4798 1.4385 0.6815 8.6035 0.3086 3.6255 6.2414 2.0324 5.4071 3.6241 8.4913 0.5518 4.1152 5.5963 7.5888 0.6414 1.9181 7.1226 20.8136 12.9205 4.6477 8.7816 3.2628 3.0717 23.1950 30.6270 5.4519 111.1546 83.2390 62.5073 24.7515 27.6823 3.8519 38.6655 6.7130 25.3144 29.2461 3.7474 1.5943 14.2349 34.1764 117.7088 3.6658 1.3361 4.0683 31.4516 3.0836 5.0150 12.7618 1.5753 3.4065 28.3492 37.9022 15.8184 4.7672 13.3410 8.6101 249.0607 14.8732 0.0723 22.0977 0.6702 60.0416 23.1891 0.2661 2.4454 55.5596 2.6553 48.3913 29.6107 24.9179 24.2690 15.0248 32.0707 0.2820 184.8559 2.2510 99.2274 0.1680 82.1296 9.4029 0.7706 128.7058 24.8227 19.6924 4.9487 4.9120 55.0573 96.6537 271.5083 2.2477 27.5664 488.3191 230.7441 139.2187 31.7282 41.8625 3.8349 38.8446 13.1641 0.1677 13.1889 3.9473 30.3059 0.7332 2.3497 35.0787 33.7357 12.1062 28.5206 13.8588 11.2955 65.1383 7.4863 152.9819 418.2032 5.5397 1.9244 60.2820 13.7084 452.5064 2.0369 22.3132 13.8594 4.7165 29.3493 13.9217 240.6252 114.0207 74.2360 17.2579 18.6692 330.2248 52.7175 260.6227 2269.8576 79.1740 121.8204 38.6762 324.7821 266.9695 319.5326 11.6549 604.5906 106.3819 4.4219 76.9205 98.6053 440.6352 20.3902 7.4698 22.7465 7.8971 5.4885 11.8802 12.8646 13.6677 13.0911 32.1281 4.1177 2.1744 23.8089 21.1383 1158.3428 39.0940 14.2722 33.1596 43.7724 16.5796 33.9592 59.8774
temp: 298.150 k
press: 1.00000 atm
elementType: 15 8 8 8 8 8 8 8 7 7 7 7 7 7 6 6 6 6 6 6 6 6 6 6 6 6 6 6 6 6 6 6 6 6 6 6 6 1 1 1 1 1 1 1 1 1 1 1 1 1 1 1 1 1 1 1 1 1 1 1
symmnumber: 1
zpe: 1173229.1 jmol-1
zpe.correction: 0.446859 hartree
zpe.thermalcorrener: 0.479385 hartree
zpe.thermalcorrenthalpy: 0.480329 hartree
zpe.thermalcorrgfe: 0.381121 hartree
zpe.sumelectzpe: -2083.912260 hartree
zpe.sumelectthermal: -2083.879734 hartree
zpe.sumelectthermalent: -2083.878790 hartree
zpe.sumelectthermalfe: -2083.977998 hartree
dipole: 0.3652 7.0584 -1.5877
dipole: 7.2440
quadrupole: -247.5282 -235.3464 -211.6435
quadrupole: -12.0479 -5.9855 5.5763
quadrupole: -16.0222 -3.8403 19.8625 -12.0479 -5.9855 5.5763
hfenergy: -2084.3591195 hartree
pointgroup: C01 [X(C23H23N6O7P1)]
dipole: 0.1174246 2.5786897 -1.2079671 debye
polarizability: 607.0838024|-5.9215304|362.1172194|-10.4354077|-36.2487432|186.4143164 unknown
InChI: InChI=1S/C23H23N6O7P/c30-16-9-18-29-20-19(21(31)27-22(26-20)28-38-36-37(32,33)34-10-17(16)35-18)25-23(29)24-13-5-6-15-12(8-13)7-11-3-1-2-4-14(11)15/h1-6,8,16-18,24,26,30,32H,7,9-10,28H2
charge 0 multiplicity 1
60 atoms
P  6.740191 0.174326 1.232236
O  3.273161 1.350643 -1.467605
O  2.953363 4.404644 -1.857535
O  5.409716 0.668404 0.178377
O  0.750256 -4.118289 1.044391
O  6.885749 -1.392631 0.769941
O  5.824885 0.249607 2.712266
O  8.001908 1.131836 1.224543
N  1.410731 0.323641 -0.333557
N  -0.92119 1.024091 -0.156602
N  -0.144222 -1.236327 0.360464
N  3.420421 -1.20864 -0.299881
N  2.919173 -3.483768 0.351849
N  5.14477 -2.873784 -0.258852
C  1.868471 1.52703 -1.07727
C  1.804508 2.851973 -0.262182
C  3.114502 3.592273 -0.650686
C  4.112652 2.432963 -0.855992
C  4.778622 1.97345 0.444391
C  2.07924 -0.896936 -0.14768
C  0.039334 0.036119 -0.021532
C  1.12503 -1.835769 0.282841
C  -2.33634 0.884782 -0.040276
C  -4.368263 -0.381378 0.325077
C  -5.155031 0.792788 0.121365
C  -5.277516 -1.569084 0.616549
C  -6.578918 0.440428 0.261581
C  -6.672293 -0.956365 0.553691
C  -2.967327 -0.355656 0.253561
C  1.509148 -3.215514 0.60796
C  3.7344 -2.536131 -0.044965
C  -3.112665 2.062425 -0.241257
C  -4.518241 2.022042 -0.160472
C  -7.745888 1.229584 0.151422
C  -7.926541 -1.564069 0.734512
C  -9.005631 0.613068 0.33408
C  -9.097717 -0.771648 0.622933
H  1.274153 1.578882 -2.011773
H  1.778807 2.632274 0.819144
H  0.94335 3.48925 -0.52377
H  3.435729 4.309031 0.120911
H  4.878107 2.664907 -1.613927
H  4.059202 1.852164 1.27573
H  5.549287 2.712022 0.739807
H  2.86028 3.812455 -2.648404
H  -0.594129 1.979841 -0.295084
H  4.153555 -0.471467 -0.397928
H  -5.062463 -2.016104 1.60681
H  -5.144132 -2.379926 -0.12599
H  -2.354761 -1.244565 0.422312
H  -2.610212 3.01304 -0.466604
H  -5.0988 2.937386 -0.3184
H  -7.68358 2.300821 -0.072348
H  -8.004824 -2.634259 0.958618
H  -9.921085 1.209945 0.251704
H  -10.082357 -1.232301 0.761199
H  5.274488 -3.837322 0.091381
H  5.402545 -2.834056 -1.259761
H  6.037686 -2.049713 0.360579
H  6.379008 0.331362 3.529309
