program: Gaussian 09
title: 000146013
version: EM64L-G09RevD.01
frameworkgroup: C1[X(C16H12O3)]
method: RPBEPBE
basis: SDD
operation: Freq
keyword: #pfreq=noraman
keyword: PBEPBE/SDD
title: #p freq=noraman PBEPBE/SDD
converged: YES YES NO NO
title: Mulliken charges:
elementType: O O O C C C C C C C C C C C C C C C C H H H H H H H H H H H H
charge: -0.290131 -0.312083 -0.267256 0.193980 0.132458 0.188279 0.105356 0.296656 0.076272 -0.351462 -0.355237 -0.360012 -0.372096 -0.249256 -0.208329 -0.229036 -0.232967 -0.238988 -0.516519 0.280580 0.260396 0.260449 0.298928 0.236515 0.236421 0.228249 0.229450 0.231490 0.215098 0.286184 0.226613
chargesum: 0.00000
title: Mulliken charges with hydrogens summed into heavy atoms:
elementType: O O O C C C C C C C C C C C C C C C C
charge: -0.290131 -0.312083 -0.267256 0.193980 0.132458 0.188279 0.105356 0.296656 0.076272 -0.070882 -0.094842 -0.099563 -0.073168 -0.012741 0.028092 -0.000787 -0.003518 -0.007498 0.211376
polarizability: 3.05537400e+02 -8.16828935e+00 2.18055961e+02 -1.84151815e+00 -9.49196295e+00 7.88492369e+01
1716.lowfreq: -4.5532 -0.0005 0.0005 0.0006 3.8443 6.0095 40.9276 52.1472 66.3367
frequency: 40.8774 52.1384 66.3349 81.3488 111.3751 132.5470 157.3710 185.0067 206.8987 271.5056 276.5410 293.5390 321.5500 347.3344 375.5119 404.1977 427.3441 439.2500 486.7306 496.6631 530.2995 567.1696 614.4684 623.5445 629.7675 656.4430 664.3569 696.6343 700.3663 763.5689 781.3952 790.6195 817.2937 858.9003 873.5594 879.3142 900.1947 943.8979 970.3244 975.6384 988.2309 990.8921 999.5874 1004.8791 1024.7656 1032.2187 1075.8065 1095.5532 1107.4429 1120.5168 1145.9732 1163.9245 1175.3228 1184.4642 1198.7345 1219.3305 1233.7132 1281.9904 1318.3782 1344.1188 1382.8823 1405.6697 1416.3654 1435.4238 1448.1194 1453.0021 1460.5742 1475.3882 1486.1096 1535.3991 1544.2117 1579.0683 1594.0832 1609.8527 1618.6864 2986.5831 3100.9516 3128.8472 3140.0673 3140.0921 3141.4118 3153.1743 3159.1521 3166.2017 3176.5667 3177.2696 3198.9806
redmass: 3.7669 5.4195 4.9534 2.1504 3.2964 2.7824 2.0907 5.0487 4.2827 5.7890 6.3391 5.5746 5.3950 8.9251 6.5249 2.8763 3.9490 4.7280 5.0359 6.5113 4.1103 8.7674 6.4654 5.0376 7.8645 7.0874 6.6230 2.7012 2.4007 1.9169 1.8643 2.5244 6.1328 1.2486 6.8122 1.4521 8.5088 1.4252 1.3655 8.3847 6.0006 1.3947 1.3267 1.3227 2.0280 2.1708 2.4227 1.9336 1.2718 2.6950 1.4307 1.1314 1.0543 2.6239 1.1694 3.1996 2.6986 2.0128 1.6813 2.4488 7.7535 8.5060 1.3026 2.3636 2.7110 1.0843 2.6263 2.2895 1.0640 7.8282 7.9245 6.0729 7.7269 6.0065 7.1051 1.0328 1.0993 1.0854 1.1056 1.0864 1.0906 1.0900 1.0967 1.0955 1.1002 1.0960 1.0945
irintensity: 0.4196 0.2253 5.4231 3.7670 1.6392 0.4941 3.8280 0.2239 1.3496 0.5227 0.3095 3.3497 9.1332 5.8215 1.9368 0.0049 0.7039 2.4723 8.8737 6.1151 0.7335 0.6317 0.2538 1.5328 5.9325 19.4791 9.6665 10.1745 54.6902 98.7829 17.9799 33.0604 2.4695 0.6210 23.4486 0.3388 12.2761 6.2166 2.8110 17.7962 0.6278 1.0901 0.2768 0.8251 11.0817 11.0528 54.4370 19.0587 11.3967 79.2303 21.3708 0.0503 0.3786 153.9881 21.8801 9.1339 17.7462 29.4233 46.8530 142.3912 6.5962 17.4809 95.5242 24.1893 74.5712 7.2491 8.1942 24.4408 38.3600 237.0442 47.4650 4.7022 75.3967 4.6902 23.9438 77.7077 32.2927 0.1170 5.3203 3.5630 18.8213 5.3694 36.7291 9.6718 19.1848 11.3845 8.0296
temp: 298.150 k
press: 1.00000 atm
elementType: 8 8 8 6 6 6 6 6 6 6 6 6 6 6 6 6 6 6 6 1 1 1 1 1 1 1 1 1 1 1 1
symmnumber: 1
zpe: 617463.3 jmol-1
zpe.correction: 0.235179 hartree
zpe.thermalcorrener: 0.250723 hartree
zpe.thermalcorrenthalpy: 0.251667 hartree
zpe.thermalcorrgfe: 0.191729 hartree
zpe.sumelectzpe: -841.239170 hartree
zpe.sumelectthermal: -841.223627 hartree
zpe.sumelectthermalent: -841.222683 hartree
zpe.sumelectthermalfe: -841.282620 hartree
dipole: 0.8589 -2.5789 1.4738
dipole: 3.0920
quadrupole: -91.9622 -101.1001 -113.8290
quadrupole: 9.8557 -0.8084 2.1399
quadrupole: 10.3349 1.1970 -11.5319 9.8557 -0.8084 2.1399
hfenergy: -841.4743498 hartree
pointgroup: C01 [X(C16H12O3)]
dipole: 0.3245495 0.8891224 -0.7641629 debye
polarizability: 304.114875|14.2197062|209.3993158|9.7196933|-36.0803898|88.9284077 unknown
InChI: InChI=1S/C16H12O3/c1-18-16-14(17)12-9-5-6-10-13(12)19-15(16)11-7-3-2-4-8-11/h2-10H,1H3
charge 0 multiplicity 1
31 atoms
O  -0.251726 1.150531 -0.271194
O  0.952727 -2.22343 0.615933
O  -1.90471 -2.572791 0.621748
C  -2.235289 -0.274767 -0.046834
C  0.6027 0.065084 0.010214
C  -1.639716 0.979704 -0.323052
C  0.064408 -1.19835 0.278983
C  2.018262 0.483818 -0.022203
C  -1.39473 -1.441223 0.307677
C  -3.652573 -0.374513 -0.096305
C  -2.407214 2.121085 -0.644754
C  2.362676 1.716099 -0.654693
C  3.057055 -0.289842 0.574118
C  -4.432623 0.746629 -0.419497
C  -3.806831 1.996148 -0.693651
C  3.70081 2.151668 -0.701172
C  4.394005 0.156396 0.524676
C  4.726033 1.373568 -0.113208
C  0.759871 -3.550856 -0.02617
H  -4.098562 -1.349097 0.126905
H  -1.903013 3.070944 -0.844411
H  1.573874 2.322229 -1.10754
H  2.804112 -1.226149 1.073186
H  -5.523574 0.665101 -0.459342
H  -4.418152 2.870172 -0.942255
H  3.945516 3.097776 -1.196415
H  5.178872 -0.448316 0.992221
H  5.766966 1.713743 -0.148786
H  0.843742 -3.454118 -1.12476
H  -0.218708 -3.967741 0.254138
H  1.586195 -4.164601 0.362842
