program: Gaussian 09
title: 000146005
version: EM64L-G09RevD.01
frameworkgroup: C1[X(C3H6ClNO3)]
method: RPBEPBE
basis: SDD
operation: Freq
keyword: #p
keyword: freq=noraman
keyword: PBEPBE/SDD
title: #p freq=noraman PBEPBE/SDD
converged: YES YES NO NO
title: Mulliken charges:
elementType: Cl O O O N C C C H H H H H H
charge: -0.052882 -0.291800 -0.264639 -0.377989 -0.322567 -0.184646 -0.584803 0.331273 0.235573 0.256743 0.260724 0.276467 0.339162 0.379383
chargesum: 0.00000
title: Mulliken charges with hydrogens summed into heavy atoms:
elementType: Cl O O O N C C C
charge: -0.052882 -0.291800 -0.264639 0.001394 0.016595 0.307671 -0.047611 0.331273
polarizability: 7.59146813e+01 7.47478526e-01 5.94749953e+01 2.33717046e+00 9.43856720e-01 4.40262764e+01
1716.lowfreq: -19.5754 -4.8665 -0.0011 0.0003 0.0021 7.4527 19.9638 54.5927 115.4692
frequency: 16.0959 54.5739 115.4451 147.2790 189.8502 204.9510 260.5100 290.2809 406.7636 450.9226 526.9268 609.1325 679.3429 705.0735 824.7200 937.4936 944.2922 985.7104 1042.0415 1091.7829 1170.8819 1179.1273 1224.0238 1298.8282 1344.9061 1373.3827 1435.4145 1442.9001 1461.1597 1678.3010 2996.4729 3063.0641 3076.7707 3147.4493 3506.8505 3557.6448
redmass: 7.4309 8.1742 4.8643 4.0331 5.2062 1.3360 2.4198 5.6982 3.4714 4.9005 1.3089 4.7535 8.1639 4.8914 2.7886 2.1554 5.4228 1.8827 3.8159 3.1323 1.4600 1.7850 1.1636 1.1959 1.3654 1.3919 1.1091 1.2852 1.1145 10.1984 1.0612 1.0640 1.0958 1.1098 1.0689 1.0789
irintensity: 5.1795 7.2572 4.1358 7.6887 6.9633 79.1888 5.1377 14.5332 12.2519 2.4367 210.0075 27.9240 31.8288 15.3582 0.5851 6.5029 12.3995 14.0719 199.2136 108.8531 55.2972 121.5108 4.2749 23.7025 153.0405 37.6017 19.7704 45.6274 20.9079 263.7415 20.2891 11.4098 17.9708 9.0628 22.3654 42.9997
temp: 298.150 k
press: 1.00000 atm
elementType: 17 8 8 8 7 6 6 6 1 1 1 1 1 1
symmnumber: 1
zpe: 259831.1 jmol-1
zpe.correction: 0.098964 hartree
zpe.thermalcorrener: 0.108438 hartree
zpe.thermalcorrenthalpy: 0.109382 hartree
zpe.thermalcorrgfe: 0.061985 hartree
zpe.sumelectzpe: -857.702499 hartree
zpe.sumelectthermal: -857.693025 hartree
zpe.sumelectthermalent: -857.692081 hartree
zpe.sumelectthermalfe: -857.739478 hartree
dipole: 0.6124 -0.0660 0.9529
dipole: 1.1346
quadrupole: -56.4746 -52.7578 -51.4767
quadrupole: 12.2610 5.8103 2.1300
quadrupole: -2.9049 0.8118 2.0930 12.2610 5.8103 2.1300
hfenergy: -857.801463 hartree
pointgroup: C01 [X(C3H6Cl1N1O3)]
dipole: -0.2593872 -0.0521088 -0.3595362 debye
dipolederiv: -0.2919775 -0.107024 0.0412254 -0.1834023 -0.3718421 0.1095863 0.1021499 0.1471 -0.2593988 -1.7605123 0.2069675 -0.1688659 0.1432626 -0.4590745 -0.0756455 -0.2359765 -0.0575748 -0.3658444 -0.6660712 -0.1137752 -0.0824377 -0.0797728 -0.9127037 -0.2040298 -0.1271141 -0.2650304 -0.450125 -0.4900067 0.1605859 -0.039292 -0.017833 -0.3617129 -0.0175798 0.0086083 -0.1084133 0.022506 -0.1201816 0.1776317 0.0687313 0.5443788 -0.744741 0.042459 0.004223 0.2201442 -0.3399731 0.7436399 -0.2089546 -0.0409419 -0.5163695 0.2744621 0.0012416 -0.0944914 0.0199465 0.2356537 0.2437233 0.1913187 -0.1200231 0.2549051 0.4964699 -0.2199327 -0.1634773 -0.2103843 0.3133181 1.8934014 -0.258124 0.2491345 -0.2670989 1.4835936 0.3420837 0.3699188 0.3523759 0.51952 -0.0469676 -0.0636978 0.046425 0.0851586 -0.0623725 0.0791633 0.0125349 0.0834112 0.0443948 0.01097 0.0200661 -0.0247061 0.1006741 0.0644753 -0.0131297 0.0249887 -0.0590038 -0.0670031 -0.0380225 0.0474626 0.0274667 0.0518687 -0.0722154 0.0502455 0.0463052 0.0318873 0.0778404 0.0962147 -0.0340648 0.047047 -0.0723914 0.010715 -0.0004615 0.012255 0.0074845 -0.0944624 0.1121984 0.0227124 -0.0218885 -0.0197878 0.2985891 -0.0707492 0.0021197 -0.136896 0.2920805 0.3135916 -0.0411045 0.0181254 -0.0235923 0.3563571 -0.0232512 0.0379559 -0.0250471 0.0714933 unknown
polarizability: 76.1019414|-0.3172963|59.3059041|0.7047904|-1.7097865|44.0081074 unknown
InChI: InChI=1S/C3H6ClNO3/c4-1-2-8-3(6)5-7/h5,7H,1-2H2
charge 0 multiplicity 1
14 atoms
Cl -3.228226 -1.07606 0.620826
O  -0.293787 -0.172376 -0.404521
O  1.392628 1.183953 0.554205
O  3.215661 -0.863441 -0.246854
N  1.78533 -1.029562 -0.163141
C  -1.294361 0.861053 -0.055254
C  -2.65448 0.34351 -0.477808
C  1.016781 0.112474 0.028205
H  -1.056234 1.790489 -0.609562
H  -1.245755 1.079538 1.025826
H  -3.417744 1.129106 -0.371072
H  -2.643558 -0.053346 -1.503143
H  1.451157 -1.786442 -0.763865
H  3.521288 -0.826397 0.699959
