program: Gaussian 09
title: 000146093
version: EM64L-G09RevD.01
frameworkgroup: C1[X(C21H22O8)]
method: RPBEPBE
basis: SDD
operation: Freq
keyword: #pfreq=noraman
keyword: PBEPBE/SDD
title: #p freq=noraman PBEPBE/SDD
converged: YES YES NO NO
title: Mulliken charges:
elementType: O O O O O O O O C C C C C C C C C C C C C C C C C C C C C H H H H H H H H H H H H H H H H H H H H H H
charge: -0.296055 -0.310428 -0.296693 -0.205358 -0.282317 -0.234374 -0.304427 -0.293210 0.200250 0.160721 0.125644 0.089261 0.078856 0.002127 0.188463 0.337578 0.233701 -0.584923 -0.514450 -0.384799 0.224723 0.174928 -0.338428 -0.515709 -0.523380 -0.535991 -0.519450 -0.530105 -0.529799 0.270292 0.320798 0.272469 0.251173 0.225124 0.211868 0.287049 0.229218 0.254299 0.226382 0.224634 0.254927 0.220220 0.219058 0.268046 0.229723 0.248074 0.224487 0.231411 0.230010 0.260408 0.223974
chargesum: 0.00000
title: Mulliken charges with hydrogens summed into heavy atoms:
elementType: O O O O O O O O C C C C C C C C C C C C C C C C C C C C C
charge: -0.296055 -0.310428 -0.296693 -0.205358 -0.282317 -0.234374 -0.304427 -0.293210 0.200250 0.160721 0.125644 0.089261 0.078856 0.002127 0.188463 0.337578 0.233701 -0.314631 -0.193652 -0.112330 0.224723 0.174928 -0.087255 0.208332 0.186519 0.163791 0.197377 0.173867 0.184593
polarizability: 4.44537995e+02 2.04092330e+01 3.24459874e+02 -4.60523189e+00 6.93835560e+00 1.39153666e+02
1716.lowfreq: -1.6013 -0.0002 0.0003 0.0007 3.3914 4.5233 21.6405 27.2857 42.2425
frequency: 21.5477 27.1303 42.2088 50.0213 54.1022 58.4845 67.1372 75.6703 78.6182 94.8195 100.9604 110.6812 121.0198 123.5707 139.0172 147.8843 151.2461 155.4607 161.1597 167.8396 172.6123 190.6137 202.8808 215.0671 226.7999 240.7201 258.2126 266.9021 283.5694 293.4632 300.2098 327.4303 346.7089 351.6318 360.7910 372.0063 386.1727 415.0843 438.5487 458.8664 465.1585 486.1433 489.5603 530.2689 559.2569 570.2020 573.1540 589.1568 613.3416 652.2673 659.7431 690.1712 700.9453 713.1475 742.2973 753.5326 758.6090 786.4836 825.1521 846.1994 849.0590 853.8809 907.1808 909.8317 922.9251 932.2116 945.3464 953.0424 976.1176 985.1602 999.6737 1049.3055 1090.7514 1103.3985 1106.9444 1108.8365 1108.9481 1112.4420 1114.2694 1114.6434 1128.1319 1144.4011 1150.0423 1152.3807 1155.8010 1157.4806 1161.3629 1165.4916 1189.4463 1203.6873 1221.8278 1249.7777 1268.5606 1304.1301 1317.7050 1359.7630 1366.1693 1393.3172 1403.2078 1411.6237 1418.1053 1423.9361 1430.5836 1442.1058 1442.3805 1451.8174 1453.3332 1456.5402 1457.0169 1459.0756 1463.3181 1469.4233 1475.6681 1476.2907 1479.6126 1481.7947 1484.3670 1487.5426 1488.2199 1534.1498 1550.4572 1565.2041 1574.8307 1607.5503 1609.1062 2962.8094 2969.9597 2977.0504 2977.3046 2984.3520 2984.7840 3053.6733 3064.3248 3076.2416 3078.9761 3094.0196 3099.1741 3119.7902 3120.5230 3125.4219 3133.6542 3136.6121 3139.2201 3153.8080 3178.6106 3186.4056 3196.9318
redmass: 4.7749 4.3463 3.6466 4.4467 4.5965 2.1038 2.7037 3.2368 3.2171 2.5661 2.2897 2.8805 2.6623 1.8640 1.4196 1.9576 1.3841 2.2074 1.2516 2.8408 2.3795 3.3349 3.4178 2.5258 4.6711 4.4837 5.0565 1.7113 5.0673 7.0626 6.4247 5.6097 5.8604 5.8783 6.1861 5.5373 5.9994 7.6187 5.5338 5.9601 7.0898 6.4454 3.7822 8.4633 6.4514 7.3903 5.6726 5.2245 6.2577 7.1496 5.9079 6.3830 5.2660 5.7675 5.2788 4.6738 5.5603 4.8379 6.1501 4.1827 1.5834 2.3885 8.9813 7.7403 8.0438 1.5523 8.5286 9.2681 1.3826 4.1098 5.5616 7.5202 3.0774 1.2804 1.2623 1.3193 1.4786 1.3197 1.4652 1.5624 2.4859 1.7665 1.3565 1.3939 1.3610 1.4558 1.7739 2.0691 2.6777 1.7574 2.8414 2.2910 2.7017 5.4751 5.6466 5.9072 6.1680 8.8041 2.5341 1.2924 1.2315 1.1950 1.1694 1.3606 1.3437 1.1022 1.1167 1.0557 1.0595 1.0751 1.3092 1.0513 1.1499 1.0564 2.0420 2.1186 1.0596 1.0842 1.0535 8.7137 7.6871 10.1894 8.4149 8.0571 6.8116 1.0329 1.0306 1.0309 1.0306 1.0336 1.0333 1.1040 1.1045 1.1032 1.1040 1.0982 1.0986 1.1023 1.1032 1.1035 1.0996 1.1055 1.1059 1.0887 1.0958 1.0905 1.0920
irintensity: 0.7427 0.1716 0.8678 0.5605 3.4883 1.0838 8.6247 6.9961 3.7695 3.7372 1.9312 10.0459 2.3613 1.1099 1.2905 2.9582 0.2604 1.0466 0.5564 0.7031 1.2811 4.1456 8.8413 1.2668 12.9488 7.6968 13.7246 2.5977 2.1551 3.8114 5.6603 14.1654 2.6610 1.6410 0.4889 6.4980 3.5451 9.4832 3.2633 2.8152 2.0305 0.6567 6.8731 8.7594 4.3772 18.9708 5.2394 4.6616 24.0196 7.0318 3.7710 6.2887 2.3298 16.6090 4.6620 30.5077 16.2180 5.4122 1.9762 10.3025 43.7168 37.9370 9.1021 33.5610 3.5288 35.4693 85.9638 25.0363 9.1948 89.7350 127.4331 122.2760 61.5152 42.6568 1.5045 14.6837 49.3428 58.0431 18.5224 6.9344 111.3769 40.0488 3.1820 4.6031 8.8339 54.3159 74.2715 37.0909 173.8779 117.1161 124.2251 142.3136 8.7227 306.5890 40.7866 228.9440 6.8513 1.1762 34.6933 90.9981 27.2147 0.2760 9.2196 27.9758 44.3126 26.7468 40.5740 6.5644 14.2936 11.0992 125.1021 14.6853 31.5669 12.7841 158.2186 12.2093 22.4328 51.5151 23.8391 230.9774 4.9032 152.8136 184.9852 212.0776 9.0457 80.2820 71.1056 32.8856 124.4204 99.5623 69.5159 42.5858 27.4728 24.0873 27.1306 33.2889 33.6277 26.9200 20.7867 25.4729 16.0451 12.8779 6.0362 5.0470 3.5815 2.6436 8.6544
temp: 298.150 k
press: 1.00000 atm
elementType: 8 8 8 8 8 8 8 8 6 6 6 6 6 6 6 6 6 6 6 6 6 6 6 6 6 6 6 6 6 1 1 1 1 1 1 1 1 1 1 1 1 1 1 1 1 1 1 1 1 1 1
symmnumber: 1
zpe: 1023441.2 jmol-1
zpe.correction: 0.389808 hartree
zpe.thermalcorrener: 0.420044 hartree
zpe.thermalcorrenthalpy: 0.420989 hartree
zpe.thermalcorrgfe: 0.327435 hartree
zpe.sumelectzpe: -1412.963509 hartree
zpe.sumelectthermal: -1412.933273 hartree
zpe.sumelectthermalent: -1412.932329 hartree
zpe.sumelectthermalfe: -1413.025883 hartree
dipole: 0.0612 -2.7829 -1.3484
dipole: 3.0930
quadrupole: -130.1592 -160.9535 -167.9464
quadrupole: -4.4337 -4.6741 -11.3737
quadrupole: 22.8606 -7.9338 -14.9267 -4.4337 -4.6741 -11.3737
hfenergy: -1413.3533175 hartree
pointgroup: C01 [X(C21H22O8)]
dipole: -0.0130946 -0.9440141 0.7677491 debye
polarizability: 443.2886535|-25.0529956|312.492225|-11.3891989|-46.56169|152.3706563 unknown
InChI: InChI=1S/C21H22O8/c1-23-12-8-7-11(9-13(12)24-2)18-21(28-6)17(22)16-14(25-3)10-15(26-4)19(27-5)20(16)29-18/h7-10H,1-6H3
charge 0 multiplicity 1
51 atoms
O  -0.510372 -0.668904 0.112372
O  0.948381 2.577592 -0.806103
O  -2.110031 -2.779918 0.775222
O  -4.350336 2.245487 -0.568609
O  -5.013773 -2.347384 0.792658
O  -1.819193 3.060383 -1.149003
O  5.319868 0.764825 -0.865575
O  5.712195 -1.813339 0.479627
C  -2.399851 0.860353 -0.258329
C  -1.881394 -0.412351 0.107155
C  0.434252 0.347873 -0.136629
C  -0.01478 1.614923 -0.49361
C  -1.460925 1.933565 -0.667419
C  -2.687258 -1.533367 0.448529
C  -3.835225 0.99952 -0.232259
C  1.808241 -0.160948 0.016792
C  -4.088501 -1.341814 0.493368
C  -4.647801 -0.084456 0.151885
C  2.938243 0.540329 -0.491051
C  2.023407 -1.399546 0.693588
C  4.235527 0.019781 -0.336821
C  4.436794 -1.240994 0.298419
C  3.319831 -1.926109 0.827685
C  0.771881 3.94973 -0.261994
C  -1.509825 -3.503107 -0.372771
C  -5.808462 2.410303 -0.551232
C  -4.757907 -3.216632 1.966019
C  6.2447 1.292907 0.164469
C  6.480607 -2.070385 -0.763289
H  -5.735234 -0.001849 0.205727
H  2.81118 1.49594 -1.001696
H  1.168045 -1.940393 1.106685
H  3.494289 -2.879975 1.335381
H  1.678324 4.486367 -0.580877
H  0.718676 3.915368 0.842443
H  -0.136987 4.406659 -0.680034
H  -1.173673 -4.468292 0.036282
H  -0.648987 -2.942385 -0.776287
H  -2.265745 -3.667217 -1.163457
H  -6.298691 1.721677 -1.265892
H  -5.972167 3.451709 -0.862334
H  -6.219925 2.250763 0.464389
H  -4.755565 -2.60678 2.889172
H  -3.798384 -3.746484 1.865439
H  -5.604303 -3.919431 1.981266
H  6.671982 0.473888 0.772111
H  5.713309 2.007466 0.821251
H  7.038382 1.814175 -0.392078
H  7.458454 -2.446028 -0.426273
H  6.597302 -1.147089 -1.357041
H  5.967223 -2.842309 -1.36687
