program: Gaussian 09
title: 000146002
version: EM64L-G09RevD.01
frameworkgroup: C1[X(C3H3N3O2)]
method: RPBEPBE
basis: SDD
operation: Freq
keyword: #pfreq=noraman
keyword: PBEPBE/SDD
title: #p freq=noraman PBEPBE/SDD
converged: NO NO NO NO
title: Mulliken charges:
elementType: O O N N N C C C H H H
charge: -0.168904 -0.111653 -0.096986 0.000342 0.159312 -0.097978 -0.288058 -0.240804 0.304077 0.267238 0.273413
chargesum: 0.00000
title: Mulliken charges with hydrogens summed into heavy atoms:
elementType: O O N N N C C C
charge: -0.168904 -0.111653 -0.096986 0.000342 0.159312 0.206099 -0.020819 0.032609
polarizability: 9.13305956e+01 8.60481362e-01 6.77339248e+01 1.22568081e-03 -5.16380052e-04 2.34436841e+01
1716.lowfreq: -3.2131 -0.6701 0.0014 0.0014 0.0016 12.9620 88.7273 166.1246 235.8142
frequency: 88.7272 166.1222 235.8141 399.4386 526.1796 572.5389 622.2539 666.9937 736.2551 757.7750 843.9612 882.9347 895.4458 895.7992 1000.3697 1043.2316 1116.6068 1161.2215 1192.6333 1274.8570 1328.3753 1387.3542 1468.1130 1501.1124 3226.6267 3244.0163 3270.3531
redmass: 7.6643 6.4876 7.1642 10.6179 9.6876 4.3314 3.7524 13.5918 14.0798 1.2080 1.2679 5.9190 4.7298 1.3990 1.9655 1.7547 2.7309 5.9020 1.8700 4.0803 2.8475 4.1013 9.8789 5.1058 1.0939 1.0981 1.1083
irintensity: 2.3005 0.0922 0.3780 12.7369 0.7738 2.2355 4.2059 3.7338 121.6608 113.9458 5.8263 42.6827 23.6876 1.5693 146.7724 0.1490 279.7261 97.6904 4.9275 64.9974 0.7992 12.7100 127.4029 48.5612 1.5309 1.6174 7.7875
temp: 298.150 k
press: 1.00000 atm
elementType: 8 8 7 7 7 6 6 6 1 1 1
symmnumber: 1
zpe: 182461.1 jmol-1
zpe.correction: 0.069496 hartree
zpe.thermalcorrener: 0.075766 hartree
zpe.thermalcorrenthalpy: 0.076710 hartree
zpe.thermalcorrgfe: 0.038613 hartree
zpe.sumelectzpe: -430.088633 hartree
zpe.sumelectthermal: -430.082362 hartree
zpe.sumelectthermalent: -430.081418 hartree
zpe.sumelectthermalfe: -430.119515 hartree
dipole: -3.8214 2.0882 -0.0005
dipole: 4.3548
quadrupole: -43.4232 -46.6776 -45.8059
quadrupole: -0.2992 -0.0016 -0.0009
quadrupole: 1.8791 -1.3754 -0.5037 -0.2992 -0.0016 -0.0009
hfenergy: -430.1581286 hartree
pointgroup: C01 [X(C3H3N3O2)]
dipole: 1.5188539 -0.7927508 -0.0001909 debye
dipolederiv: -0.6939287 -0.1455465 -0.0001294 -0.3936937 -0.6921537 -0.0002744 0.000201 0.0001464 -0.1852294 -0.6980926 0.1964708 -0.0000776 0.3870059 -0.6121351 0.0001137 0.0003462 -0.0003076 -0.1350199 -1.4901344 0.0144475 -0.0001244 0.0304851 -0.0694347 -0.0000487 -0.0001766 -0.0000004 0.035937 0.0849216 0.1256748 0.0000667 0.4348735 -0.2609089 0.0000174 -0.0000236 0.0000077 -0.1461931 2.5537623 -0.024989 0.000283 -0.0023004 1.2592659 0.0001606 -0.0001719 0.0001718 0.1951216 0.4748974 -0.044565 0.000037 -0.4088395 -0.0790446 -0.0000162 -0.0000608 0.0000033 -0.1114643 -0.2718187 -0.1137984 -0.0000267 -0.4090413 -0.1140962 -0.0000234 -0.0001912 -0.0000166 -0.1875289 -0.1539154 0.0094636 0.0000406 0.3587808 0.3278601 0.0001789 0.0000503 0.000105 -0.0859958 0.1171436 -0.0354856 -0.0000205 -0.0022168 0.1028587 -0.0000334 -0.0000159 -0.0000518 0.2393738 0.0324856 0.0687153 -0.0000124 0.0615228 0.0813384 -0.0000191 -0.0000034 -0.0000254 0.2041159 0.0446794 -0.0503876 -0.0000362 -0.0565764 0.05645 -0.0000554 0.0000458 -0.0000326 0.1768832 unknown
polarizability: 91.2892123|1.3096591|67.7753051|0.0066424|0.0103117|23.4436871 unknown
InChI: InChI=1S/C3H3N3O2/c7-6(8)5-3-1-2-4-5/h1-3H
charge 0 multiplicity 1
11 atoms
O  -2.002006 -1.198027 -0.00021
O  -2.074314 1.096997 0.000176
N  -0.01919 -0.015524 -0.000104
N  0.673936 1.19064 0.000304
N  -1.487809 -0.024129 -0.000485
C  0.792677 -1.151898 -0.000121
C  2.096244 -0.658222 0.000097
C  1.971229 0.779252 0.000622
H  0.376571 -2.154837 -0.000428
H  3.013228 -1.242616 0.000056
H  2.759633 1.530165 0.000994
