program: Gaussian 09
title: 000145991
version: EM64L-G09RevD.01
frameworkgroup: C1[X(C9H14O)]
method: RPBEPBE
basis: SDD
operation: Freq
keyword: #pfreq=noraman
keyword: PBEPBE/SDD
title: #p freq=noraman PBEPBE/SDD
converged: NO YES NO NO
title: Mulliken charges:
elementType: O C C C C C C C C C H H H H H H H H H H H H H H
charge: -0.228185 -0.393866 -0.395019 -0.391319 -0.571028 -0.565049 0.419704 0.120372 -0.821438 -0.202125 0.190964 0.215970 0.210285 0.210636 0.211181 0.210986 0.210530 0.245031 0.218081 0.207736 0.275232 0.228277 0.225113 0.167933
chargesum: 0.00000
title: Mulliken charges with hydrogens summed into heavy atoms:
elementType: O C C C C C C C C C
charge: -0.228185 0.013068 0.025902 0.030848 -0.115467 -0.139232 0.419704 0.120372 -0.092817 -0.034192
polarizability: 1.41163133e+02 -1.80860543e+00 9.38457403e+01 -7.09302825e+00 -4.49436584e-01 7.07146566e+01
1716.lowfreq: -29.1513 -11.7227 -0.0001 0.0000 0.0003 11.7099 53.7120 86.7988 145.4451
frequency: 53.5233 86.6455 145.4226 155.9346 170.6987 262.0790 279.5298 323.3663 371.4517 395.7241 414.2087 457.5936 485.5954 538.0230 670.3267 749.7878 781.1928 821.3073 850.1705 888.7569 895.4006 916.8414 949.9096 980.7218 1024.8760 1037.7648 1052.0253 1081.3320 1092.9992 1120.2221 1122.2881 1199.7702 1231.1591 1250.6423 1259.6380 1296.2543 1304.2427 1307.3848 1340.2225 1343.5422 1350.5832 1387.0360 1391.5750 1459.1469 1464.2176 1464.6112 1468.2030 1474.7410 1478.5125 1495.8698 1574.7462 1623.5450 2927.0655 2954.6735 2962.9991 2968.9931 2980.6737 2980.7463 2981.2403 3033.1401 3040.4571 3049.7486 3061.7944 3073.3508 3075.5613 3092.4954
redmass: 3.7506 2.6715 1.2637 2.2227 2.4151 2.8251 2.0053 2.8804 3.2622 2.1057 2.8113 3.4871 1.6733 3.4402 2.8283 3.3803 1.4901 3.1582 1.4437 2.5657 2.5599 1.3689 1.6520 2.2107 1.9238 1.5299 1.8068 1.1591 1.5890 2.0083 2.0224 2.2829 1.3735 1.3055 1.2797 1.5399 1.8614 1.2952 1.5285 1.5408 1.5161 1.2687 1.2371 1.0884 1.0925 1.0934 1.0822 1.0868 1.0925 1.0507 7.3758 6.6700 1.0840 1.0683 1.0686 1.0631 1.0483 1.0507 1.0603 1.0962 1.1024 1.1034 1.0984 1.0912 1.0928 1.0979
irintensity: 0.9411 0.2002 1.0923 3.9483 5.3241 2.6720 1.5044 7.7103 4.5237 5.4947 0.7622 0.4076 0.5212 1.7074 0.9433 14.1293 1.6343 4.7001 11.6912 12.3137 6.5383 3.4141 0.1808 7.4630 7.5719 3.3428 26.1801 0.5326 0.4442 2.4130 1.6204 12.4678 1.3781 7.1102 4.3003 16.7466 23.0723 10.7281 3.8015 0.7946 0.5786 14.1386 40.8631 9.4989 4.0452 18.1362 19.2784 22.4145 10.1703 11.2509 245.9198 91.6494 86.3347 10.1723 36.2792 35.4261 15.9135 42.9546 28.9952 61.0434 35.8332 78.4051 23.7016 46.5698 13.6863 2.4909
temp: 298.150 k
press: 1.00000 atm
elementType: 8 6 6 6 6 6 6 6 6 6 1 1 1 1 1 1 1 1 1 1 1 1 1 1
symmnumber: 1
zpe: 547436.9 jmol-1
zpe.correction: 0.208508 hartree
zpe.thermalcorrener: 0.218827 hartree
zpe.thermalcorrenthalpy: 0.219772 hartree
zpe.thermalcorrgfe: 0.172748 hartree
zpe.sumelectzpe: -425.778847 hartree
zpe.sumelectthermal: -425.768527 hartree
zpe.sumelectthermalent: -425.767583 hartree
zpe.sumelectthermalfe: -425.814606 hartree
dipole: -4.8985 0.7551 0.7583
dipole: 5.0140
quadrupole: -76.9907 -58.4758 -61.1228
quadrupole: 4.0193 1.7167 -0.7430
quadrupole: -11.4609 7.0540 4.4070 4.0193 1.7167 -0.7430
hfenergy: -425.9873543 hartree
pointgroup: C01 [X(C9H14O1)]
dipole: 1.9462417 0.21947 -0.235363 debye
dipolederiv: -1.2887208 -0.1753894 0.1046916 -0.0569224 -0.4478399 -0.0074118 0.182465 0.0222417 -0.3722166 0.0508247 0.000197 -0.0309948 0.0026621 0.0239794 -0.0094676 -0.0931171 0.0003171 0.136533 0.2116629 0.0430075 -0.0173882 -0.0994486 0.044666 -0.0172394 0.1117491 0.0206201 0.143433 0.1881796 -0.0492486 -0.027736 0.0315393 0.065216 0.0042781 0.1072212 -0.0579542 0.1338626 -0.2429987 -0.0803988 -0.05395 0.0057333 -0.0242869 -0.0097439 -0.1083295 -0.0013602 0.0859335 -0.1630043 0.0864067 -0.0309488 0.0557733 -0.0415554 -0.0082519 -0.090867 0.003377 0.1067785 0.7562429 0.1734569 -0.1064746 -0.044416 0.1769431 0.053419 -0.2662088 0.017961 -0.0950128 -0.8584221 -0.2886626 0.0422904 -0.5817004 -0.04753 0.076277 0.10442 0.0525419 -0.0652337 -0.0154635 -0.0093036 0.0131699 0.0794089 -0.1611161 -0.0498755 0.0367651 -0.0355195 0.0776515 1.4539376 0.2066162 -0.1789514 0.5787678 0.6343249 0.0063463 -0.1800994 0.037193 0.1551069 0.0307989 -0.0107882 0.0759123 -0.0207144 0.0195081 0.0078631 0.1605348 -0.004021 -0.141961 -0.1266549 0.0401753 -0.1219011 0.0466452 0.0403869 0.0269413 -0.1588671 0.0331108 -0.0277882 -0.1248891 -0.1337199 -0.0226491 -0.1216045 -0.1086385 -0.0064574 -0.0235592 0.0119118 0.0760106 0.026939 0.0399108 0.0912956 0.0346507 0.0603916 0.0233058 0.0343159 -0.0207181 -0.1449244 0.0046407 -0.0448326 0.0763042 -0.0287811 0.0740004 -0.0005736 0.0375394 0.0566072 -0.1401114 -0.0491542 0.108916 0.0032424 0.1104252 -0.1671535 -0.0416173 -0.0050751 -0.0626411 0.0649306 0.0000809 -0.0331029 0.0929802 -0.0583715 0.0744265 -0.0213452 0.0854485 0.023252 -0.1188803 0.0273786 0.0988851 -0.0073868 0.0560617 -0.1168998 -0.0139844 -0.0101688 -0.0415961 0.0638287 -0.0297342 -0.1398063 -0.0379059 -0.0791497 -0.0664921 -0.0220652 -0.0170936 0.0095284 0.0768234 0.0113744 0.0310446 0.1129332 0.0553786 0.0531871 0.0397933 0.0958817 -0.0063237 -0.1170054 -0.0528147 0.0780116 0.038581 -0.0657448 0.1617695 0.0170386 0.0223256 -0.0080307 0.1114464 0.0976384 -0.0273367 0.0558917 0.0265739 -0.0385404 0.0788425 0.0147048 0.1108045 -0.03899 0.0504396 -0.0431822 -0.1094683 0.0067687 0.0117922 -0.0660927 -0.0592837 -0.0883278 -0.0484674 0.0417185 0.129144 0.0384627 0.0664648 -0.2205393 -0.059979 0.0192983 -0.0729738 0.0782523 unknown
polarizability: 141.524326|-0.1599613|93.5217636|-5.3874097|2.581538|70.67744 unknown
InChI: InChI=1S/C9H14O/c1-8(7-10)9-5-3-2-4-6-9/h7H,2-6H2,1H3
charge 0 multiplicity 1
24 atoms
O  -3.512853 -0.605791 0.177086
C  2.873737 -0.353008 0.264089
C  2.206158 1.009924 0.553982
C  1.830213 -1.492833 0.257785
C  1.038201 1.290504 -0.439971
C  0.666393 -1.191551 -0.733927
C  0.024533 0.156541 -0.428449
C  -1.310504 0.371401 -0.128535
C  -1.884166 1.74768 0.182413
C  -2.283086 -0.744821 -0.096798
H  3.375049 -0.311124 -0.725164
H  3.66138 -0.559367 1.01394
H  2.948256 1.828181 0.485894
H  1.809133 1.016197 1.588661
H  1.41345 -1.620476 1.276739
H  2.306973 -2.451816 -0.021137
H  1.47037 1.369445 -1.460916
H  0.568634 2.260587 -0.209923
H  -0.051469 -2.027155 -0.726246
H  1.095754 -1.146978 -1.757523
H  -2.965347 1.648724 0.375611
H  -1.7471 2.450426 -0.659839
H  -1.416042 2.199593 1.07642
H  -1.889966 -1.760484 -0.329794
