program: Gaussian 09
title: 000145989
version: EM64L-G09RevD.01
frameworkgroup: C1[X(C6H6ClN5)]
method: RPBEPBE
basis: SDD
operation: Freq
keyword: #p
keyword: freq=noraman
keyword: PBEPBE/SDD
title: #p freq=noraman PBEPBE/SDD
converged: NO NO NO NO
title: Mulliken charges:
elementType: Cl N N N N N C C C C C C H H H H H H
charge: -0.010492 -0.148861 -0.082933 0.054768 0.021125 -0.609396 0.170685 -0.089236 -0.233270 0.186803 -0.606173 -0.354327 0.267823 0.260178 0.226617 0.260110 0.338803 0.347776
chargesum: 0.00000
title: Mulliken charges with hydrogens summed into heavy atoms:
elementType: Cl N N N N N C C C C C C
charge: -0.010492 -0.148861 -0.082933 0.054768 0.021125 0.077183 0.170685 -0.089236 0.034553 0.186803 0.140732 -0.354327
polarizability: 1.50416227e+02 -5.00346420e-01 1.28763955e+02 1.29000381e-03 -3.44806475e-03 4.70514863e+01
1716.lowfreq: -0.0011 0.0020 0.0021 1.6607 7.6594 9.3053 35.4411 100.9000 126.2941
frequency: 35.0181 100.8814 126.2878 176.6851 210.5821 239.6504 262.5531 323.3722 343.7383 366.0777 505.6301 525.5880 542.6701 544.0219 606.0103 627.7549 660.8210 665.3421 709.5631 760.6021 790.2462 818.5838 869.8627 994.2021 1015.5431 1043.6956 1126.4684 1177.2373 1222.9519 1232.3573 1300.1760 1314.1219 1343.9272 1385.0265 1415.0275 1436.9762 1461.1548 1480.1251 1491.3548 1551.2894 1577.0575 1633.0243 3004.4272 3096.7625 3118.6087 3230.1152 3538.0035 3692.2187
redmass: 1.0310 5.4580 5.1692 4.2598 6.8015 4.0616 4.7236 4.0824 8.3699 19.4427 7.1903 1.2306 5.6112 1.0728 4.5278 4.1325 8.8868 10.8741 6.9449 10.5998 3.7366 1.8866 7.3480 3.1514 3.2821 2.1968 1.3198 2.5131 2.1675 3.4804 6.6742 4.8842 7.6535 8.1096 2.4782 2.3099 1.0391 2.3012 1.1802 4.9893 2.1631 2.4484 1.0333 1.1024 1.1023 1.0985 1.0444 1.1057
irintensity: 0.0818 3.3475 9.3759 5.5888 1.3157 8.8484 0.1996 0.4427 0.4419 3.6762 5.8899 270.9268 12.0274 0.2953 3.0408 41.6277 3.6597 9.1445 15.3904 16.7228 19.1029 7.9567 31.0926 69.1935 13.0268 25.0992 0.6606 20.7441 176.0704 22.1117 118.8558 58.3648 89.0932 24.1841 24.9990 11.5643 16.3342 63.9335 5.9425 133.9805 71.2413 580.2374 35.5752 12.6667 9.5948 0.0910 131.4599 53.9321
temp: 298.150 k
press: 1.00000 atm
elementType: 17 7 7 7 7 7 6 6 6 6 6 6 1 1 1 1 1 1
symmnumber: 1
zpe: 333120.5 jmol-1
zpe.correction: 0.126879 hartree
zpe.thermalcorrener: 0.137253 hartree
zpe.thermalcorrenthalpy: 0.138198 hartree
zpe.thermalcorrgfe: 0.089849 hartree
zpe.sumelectzpe: -965.211423 hartree
zpe.sumelectthermal: -965.201049 hartree
zpe.sumelectthermalent: -965.200105 hartree
zpe.sumelectthermalfe: -965.248453 hartree
dipole: 4.6473 0.6485 -0.0005
dipole: 4.6924
quadrupole: -74.9227 -62.4331 -77.5228
quadrupole: -13.1261 0.0002 0.0016
quadrupole: -3.2965 9.1931 -5.8966 -13.1261 0.0002 0.0016
hfenergy: -965.3383023 hartree
pointgroup: C01 [X(C6H6Cl1N5)]
dipole: -1.7194719 0.6719998 -0.000331 debye
dipolederiv: -0.6497276 0.3997548 -0.0004319 0.4451787 -0.4583439 0.0003577 -0.0011943 0.0008161 -0.0831732 -0.5297314 0.0242132 -0.0000523 -0.2633748 -0.6067502 -0.0001346 0.0004802 0.0001617 -0.1353441 -0.4605248 -0.0935072 -0.0000477 -0.0959653 -0.5233381 -0.0000137 0.0000036 0.0000127 -0.2440513 -1.2087104 0.192444 -0.0006174 -0.0712369 -0.6246414 -0.0001775 -0.0005653 0.000359 -0.1486843 -0.5418534 0.2374414 -0.000019 0.1076739 -1.3874686 0.0003298 -0.0005281 -0.000005 -0.1939963 -0.3094968 -0.3130665 -0.0000224 -0.4575674 -1.476544 -0.0001725 -0.0000212 -0.0003754 -0.681612 0.8426148 -0.0153466 0.0000313 0.0894126 0.3736333 0.0000621 0.0000687 0.0000165 0.1121496 -0.1867544 -0.4382226 -0.0000705 -0.2784 -0.4583558 -0.0001093 0.0000203 -0.0001419 0.0099492 0.0157574 -0.0891265 -0.0001047 0.1659959 0.7002376 0.000034 -0.0002916 -0.0000388 -0.0782467 0.7034691 0.3258818 0.0001281 0.461803 1.8901273 0.0002913 -0.0000354 0.0002132 0.218794 0.2881986 0.1709948 0.0000514 0.2598582 0.4039993 0.0003351 -0.0000488 0.0001263 0.2081204 1.6065191 -0.4587481 0.0011334 -0.3636589 1.470076 -0.0006368 0.0021553 -0.0010083 -0.0020183 -0.0146424 -0.0047895 0.000012 -0.0330177 0.1033569 0.0000209 0.0000847 0.0000165 0.1810752 0.0903795 0.0167719 -0.0677138 -0.0618116 -0.0090079 0.0539244 -0.0133248 0.0956213 -0.0271809 -0.1164439 -0.0178507 0.000307 0.0847181 0.0664409 -0.0001961 0.0002982 -0.0000878 0.1250971 0.090363 0.0162682 0.067453 -0.0621545 -0.0089924 -0.0539066 0.0128773 -0.0958022 -0.0278697 0.2255108 0.084 -0.000003 0.0392943 0.2383174 -0.0000104 -0.0000144 0.0000436 0.3850072 0.1550727 -0.0371124 -0.0000334 0.0332525 0.3072535 0.0000022 0.0000355 0.0000726 0.3819841 unknown
polarizability: 149.478582|-4.4354389|129.7015904|0.0310678|-0.0029274|47.0514956 unknown
InChI: InChI=1S/C6H6ClN5/c1-12-2-9-3-4(8)10-6(7)11-5(3)12/h2H,8H2,1H3
charge 0 multiplicity 1
18 atoms
Cl 3.058406 -2.03054 0.001718
N  -1.925587 -0.672978 -0.000169
N  -1.581921 1.604222 -0.000126
N  0.436875 -1.437421 -0.000342
N  2.011682 0.441529 0.00013
N  1.334907 2.702211 0.000489
C  -0.541759 -0.485274 -0.000272
C  -0.350587 0.924792 -0.000078
C  -2.494774 0.613272 -0.000186
C  1.004134 1.376919 0.000219
C  -2.615709 -1.968369 -0.00061
C  1.662808 -0.867495 -0.000583
H  -3.573154 0.760616 -0.000055
H  -2.335274 -2.551179 0.892817
H  -3.7043 -1.798512 0.001022
H  -2.337664 -2.549431 -0.895932
H  2.317331 2.969192 0.000576
H  0.599287 3.406047 0.000384
