program: Gaussian 09
title: 000145988
version: EM64L-G09RevD.01
frameworkgroup: C1[X(C17H14O5)]
method: RPBEPBE
basis: SDD
operation: Freq
keyword: #pfreq=noraman
keyword: PBEPBE/SDD
title: #p freq=noraman PBEPBE/SDD
converged: YES YES NO NO
title: Mulliken charges:
elementType: O O O O O C C C C C C C C C C C C C C C C C H H H H H H H H H H H H H H
charge: -0.259090 -0.202965 -0.262108 -0.441175 -0.249820 -0.180173 -0.582734 0.058034 0.143735 0.203747 0.504552 -0.479266 -0.325170 -0.472716 -0.432567 0.315235 -0.306591 0.245557 -0.207346 -0.338559 0.101983 -0.536088 0.281826 0.247556 0.242096 0.281286 0.263685 0.291220 0.242689 0.260487 0.232716 0.277695 0.247959 0.225316 0.225563 0.383431
chargesum: 0.00000
title: Mulliken charges with hydrogens summed into heavy atoms:
elementType: O O O O O C C C C C C C C C C C C C C C C C
charge: -0.259090 -0.202965 -0.262108 -0.057744 -0.249820 0.101653 -0.093083 0.058034 0.143735 0.203747 0.504552 -0.197980 -0.061486 -0.181497 -0.189878 0.315235 -0.046104 0.245557 0.025370 -0.060864 0.101983 0.162750
polarizability: 2.90212007e+02 -8.09970826e+00 2.31784783e+02 1.96963515e+01 -1.43753389e+00 9.46254467e+01
1716.lowfreq: -4.4472 -0.0002 0.0001 0.0005 2.6633 5.6936 12.3295 21.7721 31.6123
frequency: 11.2439 21.4579 31.5910 54.7177 82.2021 89.4076 121.3767 143.6408 155.6619 160.2736 174.7683 199.5789 229.8551 245.3912 283.5638 300.6570 356.4369 368.8117 385.7727 414.4749 417.7122 434.8028 477.6368 490.7057 505.4168 540.8733 546.8543 557.0258 588.1486 595.8276 613.6260 630.2238 675.5107 697.6666 707.1935 723.3225 734.3790 750.8790 781.5333 822.9799 829.8564 839.2499 868.7484 875.3160 900.1816 940.8565 958.0249 959.9303 967.8683 987.5676 990.7469 1000.9467 1010.7946 1039.2318 1071.9078 1095.9907 1103.7371 1115.3855 1135.3372 1145.5050 1164.7138 1172.7791 1182.7506 1191.1949 1218.9752 1222.5915 1235.9037 1271.5262 1291.9192 1306.4517 1321.2185 1334.1993 1390.4442 1398.2984 1433.0480 1438.9497 1447.2011 1457.7887 1467.1191 1471.9047 1473.0136 1476.2364 1590.8113 1594.7095 1615.6491 1620.8547 1628.1355 1644.5585 2961.7210 2997.1274 3034.5924 3049.7451 3059.8490 3124.2697 3130.4749 3150.8810 3159.4625 3160.8505 3168.2339 3180.8912 3182.5870 3531.5409
redmass: 6.0486 6.5491 5.7892 8.5863 5.3683 4.1507 6.0523 4.7444 4.4088 4.5143 4.7541 5.8109 2.8529 1.4337 4.5893 4.1801 4.8416 7.1412 4.5768 3.8964 3.0771 3.2543 3.8704 4.9752 4.4859 6.7302 4.1668 3.3868 2.1747 4.1942 3.0486 3.3397 6.1243 2.7070 6.3181 2.8855 4.9777 5.6174 4.7022 1.6630 1.4907 3.8503 1.5824 4.9735 3.3418 1.6050 1.4922 1.3488 2.5938 5.3399 6.1627 1.3715 3.3702 2.9672 2.9924 1.7429 1.8038 1.2612 1.5729 1.6516 1.7448 1.4463 1.1549 1.4909 1.4865 2.0528 2.5245 1.5580 1.6623 1.3386 1.8703 1.8349 7.9188 7.6805 1.3124 3.0384 3.6469 1.1345 1.0490 1.8052 2.1107 1.4903 6.2391 8.9703 6.4281 8.1382 10.0096 8.6294 1.0331 1.0600 1.0855 1.1040 1.1011 1.0887 1.0995 1.0932 1.0924 1.0887 1.0920 1.0964 1.0975 1.0641
irintensity: 0.8611 0.5869 1.1536 0.0648 0.4234 3.2378 2.8062 0.2806 4.3930 0.0723 4.7293 7.9709 0.8239 0.0999 1.1851 7.2916 4.6874 11.1006 0.5651 0.2566 4.5980 12.6559 5.6108 23.4965 0.9708 10.4592 5.9403 10.1034 39.1302 50.0764 50.7348 60.7127 10.5995 6.0663 15.2754 46.8608 34.5044 21.8235 8.2426 15.9726 55.8946 49.1207 21.6955 20.3207 17.9507 7.2311 8.5341 0.3058 27.6290 70.0567 1.0264 0.2453 20.4993 245.8909 14.2030 14.8074 15.4364 0.1259 131.5682 63.8884 67.9563 52.4065 2.4098 26.6861 21.2942 2.6625 21.5643 101.0024 16.8012 35.1475 64.9428 15.5117 7.9572 33.1501 82.3208 42.2772 41.7109 12.1932 14.6071 240.7442 27.2261 79.3485 32.1585 51.8239 9.7606 46.5567 215.8426 219.4293 54.6836 8.6146 3.5465 45.3773 9.5002 7.6403 24.8776 17.0764 1.7428 2.4238 7.6212 5.7029 3.1494 45.6038
temp: 298.150 k
press: 1.00000 atm
elementType: 8 8 8 8 8 6 6 6 6 6 6 6 6 6 6 6 6 6 6 6 6 6 1 1 1 1 1 1 1 1 1 1 1 1 1 1
symmnumber: 1
zpe: 711273.0 jmol-1
zpe.correction: 0.270910 hartree
zpe.thermalcorrener: 0.290058 hartree
zpe.thermalcorrenthalpy: 0.291002 hartree
zpe.thermalcorrgfe: 0.220486 hartree
zpe.sumelectzpe: -1030.770976 hartree
zpe.sumelectthermal: -1030.751827 hartree
zpe.sumelectthermalent: -1030.750883 hartree
zpe.sumelectthermalfe: -1030.821399 hartree
dipole: 0.8322 0.4739 -0.1748
dipole: 0.9735
quadrupole: -95.5112 -129.7726 -128.7190
quadrupole: -2.7618 4.5810 1.5235
quadrupole: 22.4897 -11.7717 -10.7181 -2.7618 4.5810 1.5235
hfenergy: -1031.0418851 hartree
pointgroup: C01 [X(C17H14O5)]
dipole: 0.3278678 0.1885056 -0.0604573 debye
polarizability: 289.5295362|-8.1828022|231.7415405|22.9654143|0.4070055|95.3511603 unknown
InChI: InChI=1S/C17H14O5/c1-21-12-5-6-14-13(9-12)16(18)15(22-14)8-10-3-2-4-11(7-10)17(19)20/h2-7,9,15,19H,8H2,1H3
charge 0 multiplicity 1
36 atoms
O  0.41152 -0.346001 -0.499254
O  1.969474 2.921682 -0.005894
O  5.902782 -1.155362 0.236376
O  -5.794473 -1.967985 -0.32697
O  -3.726452 -2.805604 0.311541
C  0.266243 1.148588 -0.423244
C  -0.732546 1.5397 0.685538
C  1.69652 1.699037 -0.163195
C  2.577344 0.523942 -0.129238
C  1.775941 -0.625536 -0.325917
C  -2.182397 1.224688 0.348338
C  3.976129 0.421607 0.068849
C  2.331459 -1.922314 -0.33642
C  -2.65539 -0.10857 0.338944
C  -3.088978 2.268738 0.027973
C  4.540994 -0.871089 0.059208
C  3.71968 -2.025862 -0.142098
C  -4.004914 -0.392726 0.0132
C  -4.436445 1.98915 -0.298957
C  -4.901747 0.659071 -0.308858
C  -4.441597 -1.814684 0.025445
C  6.799671 -0.016001 0.447705
H  -0.096671 1.476829 -1.414599
H  -0.599808 2.626343 0.847783
H  -0.422692 1.027642 1.615907
H  4.565754 1.329859 0.220413
H  1.707273 -2.806677 -0.487507
H  -1.983273 -0.940497 0.573425
H  -2.736938 3.307703 0.037389
H  4.211171 -3.003745 -0.139465
H  -5.120215 2.809585 -0.541311
H  -5.94004 0.423166 -0.557045
H  7.801322 -0.454659 0.562097
H  6.528275 0.542897 1.36449
H  6.787792 0.6696 -0.421918
H  -6.020165 -2.936215 -0.298231
