program: Gaussian 09
title: 000145979
version: EM64L-G09RevD.01
frameworkgroup: C1[X(C13H11N3)]
method: RPBEPBE
basis: SDD
operation: Freq
keyword: #pfreq=noraman
keyword: PBEPBE/SDD
title: #p freq=noraman PBEPBE/SDD
converged: YES YES NO NO
title: Mulliken charges:
elementType: N N N C C C C C C C C C C C C C H H H H H H H H H H H
charge: -0.078746 -0.023795 -0.063544 -0.395072 0.490077 0.372690 -0.433616 -0.379894 -0.348093 -0.394661 -0.221421 -0.227457 -0.223050 -0.227516 -0.239057 -0.242596 0.249412 0.233711 0.238949 0.254330 0.283548 0.230370 0.227007 0.229549 0.227267 0.232184 0.229424
chargesum: 0.00000
title: Mulliken charges with hydrogens summed into heavy atoms:
elementType: N N N C C C C C C C C C C C C C
charge: -0.078746 -0.023795 -0.063544 -0.145659 0.490077 0.372690 -0.199905 -0.140945 -0.093763 -0.111113 0.008948 -0.000450 0.006499 -0.000249 -0.006873 -0.013172
polarizability: 1.99901805e+02 8.17288610e+00 1.51873277e+02 -1.75412400e+01 3.23170320e+00 1.12849543e+02
1716.lowfreq: -6.2231 -5.3176 -0.0009 -0.0007 -0.0006 5.8438 23.4583 34.7379 44.6508
frequency: 23.3511 34.7049 44.6417 66.5063 104.2403 152.3466 215.5001 221.0644 278.3321 306.2455 361.9326 402.9827 404.8131 458.9310 485.7572 516.4611 568.0534 614.9196 615.1003 630.5734 641.2768 704.4750 705.3531 742.2402 767.9776 818.7021 854.3667 859.7116 864.1578 873.8358 933.1564 937.1557 979.8922 985.1769 990.5588 991.0152 999.8145 1001.9928 1025.4962 1028.1315 1081.4589 1083.4070 1172.2461 1173.8039 1183.2185 1187.4641 1189.8190 1208.5882 1241.4855 1252.7926 1283.5271 1321.8068 1334.4034 1381.8502 1386.0522 1435.1862 1443.2188 1481.0275 1483.1629 1591.9229 1595.4760 1610.2627 1614.7998 2037.7592 2952.3149 3114.9444 3119.8462 3127.6081 3129.3087 3138.6896 3142.6203 3150.1958 3158.1704 3165.9173 3169.5113
redmass: 4.0426 3.9139 8.9506 5.0475 7.1607 6.1632 4.3834 5.8687 5.7837 5.9647 5.9474 2.8213 2.8448 3.5819 12.6899 4.0261 7.0668 6.2119 6.2600 6.1820 5.1615 1.7034 2.0276 1.9069 2.0290 3.2284 1.2491 1.2972 3.5770 4.9236 1.5364 1.4872 1.3962 1.4008 5.7668 6.1040 1.3215 1.3138 2.2636 2.1404 1.5983 1.5790 1.0567 1.0819 2.0286 1.1451 1.2731 1.8133 2.6727 2.4959 1.5614 1.2996 1.2855 8.1025 8.1648 2.2116 2.1667 2.2480 2.3044 6.1860 6.1843 6.0471 6.1059 13.6151 1.0831 1.0883 1.0863 1.0860 1.0876 1.0911 1.0932 1.0961 1.0964 1.1015 1.0988
irintensity: 0.1465 0.0193 0.0673 0.3815 0.3974 1.9591 1.7215 1.0431 2.3917 1.6333 1.3246 0.2890 0.0489 3.6162 3.5043 2.9184 9.2178 4.6905 1.7072 35.6587 16.6803 52.2106 48.3170 63.9355 42.8031 1.3627 0.1424 0.8777 7.4735 10.7734 0.1506 3.2635 0.0575 0.0625 0.3438 0.8917 0.0581 0.7062 3.3303 11.5020 5.3659 11.9206 0.1566 0.6262 3.5115 4.0945 2.4411 3.6930 81.7778 27.7974 60.3305 1.4423 1.8844 0.7811 0.1159 12.7766 12.2804 6.9265 23.6014 2.2016 0.0346 2.3442 6.6330 387.1423 21.8151 7.7899 4.9227 0.1201 1.5320 10.4836 29.6086 30.6825 29.0193 22.1785 10.1187
temp: 298.150 k
press: 1.00000 atm
elementType: 7 7 7 6 6 6 6 6 6 6 6 6 6 6 6 6 1 1 1 1 1 1 1 1 1 1 1
symmnumber: 1
zpe: 546423.1 jmol-1
zpe.correction: 0.208122 hartree
zpe.thermalcorrener: 0.221469 hartree
zpe.thermalcorrenthalpy: 0.222413 hartree
zpe.thermalcorrgfe: 0.165693 hartree
zpe.sumelectzpe: -665.067935 hartree
zpe.sumelectthermal: -665.054588 hartree
zpe.sumelectthermalent: -665.053643 hartree
zpe.sumelectthermalfe: -665.110363 hartree
dipole: -0.5775 -2.7328 -0.6928
dipole: 2.8778
quadrupole: -86.9544 -97.7704 -87.7331
quadrupole: -7.4173 -3.9289 -0.7387
quadrupole: 3.8649 -6.9511 3.0861 -7.4173 -3.9289 -0.7387
hfenergy: -665.2760563 hartree
pointgroup: C01 [X(C13H11N3)]
dipole: 0.2386756 -1.0846837 0.2199219 debye
polarizability: 194.0059005|-8.7121219|152.2630892|-27.8119458|-0.9768727|118.3556358 unknown
InChI: InChI=1S/C13H11N3/c14-16-15-13(11-7-3-1-4-8-11)12-9-5-2-6-10-12/h1-10,13H
charge 0 multiplicity 1
27 atoms
N  -0.135121 2.015855 -0.13111
N  -1.172537 2.678851 0.156205
N  -2.088703 3.421587 0.298299
C  0.075376 0.685183 0.58183
C  -1.099519 -0.266069 0.337419
C  1.430779 0.133733 0.131231
C  -2.068727 -0.466437 1.350208
C  1.866136 -1.109968 0.655899
C  -1.258075 -0.914953 -0.913413
C  2.267408 0.833507 -0.769065
C  -3.181665 -1.30798 1.121064
C  3.119901 -1.64281 0.287991
C  -2.370124 -1.750683 -1.14502
C  3.521682 0.296998 -1.141584
C  -3.334922 -1.95069 -0.127847
C  3.953851 -0.940369 -0.614251
H  0.122743 0.895208 1.672412
H  -1.953668 0.033479 2.320675
H  1.218683 -1.666583 1.344403
H  -0.505977 -0.764313 -1.696092
H  1.929104 1.793422 -1.169481
H  -3.924742 -1.459024 1.911744
H  3.444614 -2.604138 0.701653
H  -2.486695 -2.248006 -2.114325
H  4.160363 0.847525 -1.841466
H  -4.197304 -2.601964 -0.308542
H  4.926838 -1.354263 -0.901741
