program: Gaussian 09
title: 000146000
version: EM64L-G09RevD.01
frameworkgroup: C1[X(C16H12N4O3)]
method: RPBEPBE
basis: SDD
operation: Freq
keyword: #p
keyword: freq=noraman
keyword: PBEPBE/SDD
title: #p freq=noraman PBEPBE/SDD
converged: YES YES NO NO
title: Mulliken charges:
elementType: O O O N N N N C C C C C C C C C C C C C C C C H H H H H H H H H H H H
charge: -0.265181 -0.258200 -0.235255 -0.028482 -0.124524 -0.364219 -0.001005 0.182826 0.211157 0.213131 0.183688 0.060237 -0.514372 -0.508429 -0.360168 0.425027 -0.362055 0.345626 -0.399917 -0.344602 -0.059156 -0.245479 -0.682612 0.300475 0.303878 0.282622 0.262474 0.268441 0.256393 0.209014 0.209175 0.208216 0.235088 0.234960 0.361228
chargesum: 0.00000
title: Mulliken charges with hydrogens summed into heavy atoms:
elementType: O O O N N N N C C C C C C C C C C C C C C C C
charge: -0.265181 -0.258200 -0.235255 -0.028482 -0.124524 -0.002991 -0.001005 0.182826 0.211157 0.213131 0.183688 0.060237 -0.213898 -0.204551 -0.077546 0.425027 -0.099581 0.345626 -0.131476 -0.088209 -0.059156 0.172710 -0.004348
polarizability: 4.25808173e+02 -4.53369946e+00 2.11730328e+02 -9.55943730e-02 2.74789509e-03 8.92867795e+01
1716.lowfreq: -0.0004 0.0007 0.0010 1.5771 4.4180 11.2203 24.3027 51.0408 57.2765
frequency: 24.1833 51.0378 57.2317 69.4949 82.0236 97.6475 115.8508 130.6857 162.7187 191.9391 205.4957 221.1423 245.9944 263.4678 270.1787 324.3992 325.2096 380.2161 396.2062 419.6391 433.8005 442.6208 462.3295 508.0883 538.7566 556.8944 570.5967 602.3482 635.9023 648.2706 670.8206 683.3486 710.2971 721.0909 725.4357 733.9098 749.4244 798.1467 812.0004 833.5280 837.3368 871.7610 880.0157 895.7882 908.8991 922.2499 924.7451 947.1804 952.2364 976.0881 997.8350 1003.7227 1033.0274 1064.0781 1098.7291 1114.7619 1116.9504 1122.6975 1133.9206 1149.2928 1156.9378 1177.3214 1190.0685 1216.2445 1228.4311 1249.8299 1261.8906 1265.5151 1296.6937 1360.7750 1387.9886 1395.3519 1403.1720 1406.9281 1422.1422 1433.2755 1442.5527 1460.9099 1466.5795 1478.3968 1489.8277 1529.3390 1548.5237 1563.8385 1588.8210 1624.5742 1642.5864 2952.7714 2998.5831 3012.1468 3095.9641 3108.4393 3154.2147 3157.1927 3170.7921 3173.7844 3176.4826 3177.3914 3606.1734
redmass: 5.0606 8.2926 5.9473 6.0085 6.5061 2.0978 4.8788 3.4529 5.9872 6.2370 6.0447 5.9828 1.2059 6.1380 9.5555 7.0705 4.3859 6.7877 5.1807 7.0377 3.7423 6.6900 3.1246 8.7041 6.2846 3.6590 7.4030 7.0058 8.7583 7.7809 6.1535 4.1028 7.0982 3.8332 1.2260 5.5980 4.9200 3.4733 1.4212 1.1788 5.3643 1.5565 5.3869 5.2037 6.1574 1.5218 1.5183 1.3440 7.8439 2.9881 7.5258 1.3525 2.5791 2.8116 3.7086 5.1995 2.3222 1.8625 1.4294 1.9076 4.8693 2.1758 2.2328 2.3381 3.1336 5.3814 1.1459 1.5446 2.1293 1.4256 3.2720 2.3183 1.7703 2.2821 4.3563 3.4819 5.0308 1.0397 2.4772 1.1335 1.1217 6.1331 10.5165 7.2859 9.3900 7.0275 7.5251 1.0552 1.0363 1.1078 1.0989 1.1014 1.0884 1.0878 1.0920 1.0961 1.0968 1.0942 1.0847
irintensity: 1.3784 5.4592 1.5320 2.0899 0.0180 1.9952 0.1732 0.5552 4.1187 0.2864 0.8275 0.1828 0.6608 3.2045 7.7637 2.5669 0.1946 0.1992 5.1629 3.3836 1.7559 9.5684 0.0193 0.5604 4.5940 14.6877 1.8399 2.1049 5.9166 6.1885 4.6697 1.0343 4.0999 0.2434 107.8392 25.7404 39.4339 2.5745 63.3541 4.9200 0.2348 16.4636 3.6166 55.3710 62.3808 30.8223 15.5179 7.0416 51.8652 1.9022 4.8174 0.1507 107.8414 20.3429 13.2631 13.8033 23.6979 10.0141 4.8220 94.5578 14.0092 9.4009 147.0086 45.2589 44.7883 8.5688 0.0085 93.0205 268.5733 36.2400 34.1238 26.2231 28.7866 20.3425 11.0313 175.0880 268.2857 12.3399 150.9671 5.7424 7.0343 106.9166 67.0960 120.4781 133.8271 8.2329 49.3306 45.4984 28.1054 36.8395 28.6941 31.9723 0.4708 8.7276 4.1660 2.0452 9.6321 1.2045 170.1849
temp: 298.150 k
press: 1.00000 atm
elementType: 8 8 8 7 7 7 7 6 6 6 6 6 6 6 6 6 6 6 6 6 6 6 6 1 1 1 1 1 1 1 1 1 1 1 1
symmnumber: 1
zpe: 671680.1 jmol-1
zpe.correction: 0.255829 hartree
zpe.thermalcorrener: 0.274322 hartree
zpe.thermalcorrenthalpy: 0.275266 hartree
zpe.thermalcorrgfe: 0.207975 hartree
zpe.sumelectzpe: -1059.944381 hartree
zpe.sumelectthermal: -1059.925888 hartree
zpe.sumelectthermalent: -1059.924944 hartree
zpe.sumelectthermalfe: -1059.992235 hartree
dipole: 0.4286 -2.2985 0.0095
dipole: 2.3381
quadrupole: -76.1213 -142.0485 -134.3322
quadrupole: -27.9272 0.0885 0.0237
quadrupole: 41.3793 -24.5478 -16.8315 -27.9272 0.0885 0.0237
hfenergy: -1060.2002099 hartree
pointgroup: C01 [X(C16H12N4O3)]
dipole: 0.167102 0.904553 0.0074173 debye
polarizability: 425.4654991|5.0360612|211.7092506|-10.4257394|2.0684595|89.6505312 unknown
InChI: InChI=1S/C16H12N4O3/c1-2-22-10-4-6-13-12(8-10)15(21)11-5-3-9(7-14(11)23-13)16-17-19-20-18-16/h3-8,19H,2H2,1H3
charge 0 multiplicity 1
35 atoms
O  0.116337 1.250762 -0.044482
O  5.543922 -0.20552 -0.233875
O  1.159122 -2.830265 -0.14731
N  -5.736344 -0.590816 0.107344
N  -5.01042 1.594811 0.123813
N  -6.757671 0.313557 0.158033
N  -6.359568 1.6477 0.169233
C  -0.559415 -1.129105 -0.065628
C  1.86522 -0.512007 -0.126921
C  -0.873808 0.258552 -0.031701
C  1.468306 0.854958 -0.091353
C  0.848699 -1.596174 -0.115937
C  3.244658 -0.818475 -0.173534
C  -2.205079 0.717805 0.017549
C  -1.635076 -2.059124 -0.049714
C  -3.253489 -0.226708 0.033219
C  2.422129 1.890605 -0.101167
C  4.208002 0.209391 -0.184847
C  -2.964116 -1.625589 -0.001241
C  3.791992 1.573673 -0.147505
C  -4.641741 0.24011 0.08654
C  6.596103 0.832711 -0.256833
C  7.932861 0.100199 -0.325156
H  3.550712 -1.868365 -0.201314
H  -2.416382 1.790006 0.043676
H  -1.378381 -3.122965 -0.076734
H  2.081986 2.929605 -0.072251
H  -3.790128 -2.3424 0.011107
H  4.523845 2.38604 -0.153984
H  6.449603 1.48633 -1.141528
H  6.522832 1.452156 0.660931
H  8.763626 0.828825 -0.34166
H  8.061139 -0.557996 0.550754
H  7.99129 -0.519247 -1.236035
H  -7.738866 0.037762 0.185511
