program: Gaussian 09
title: 000145972
version: EM64L-G09RevD.01
frameworkgroup: C1[X(C6H7NO3)]
method: RPBEPBE
basis: SDD
operation: Freq
keyword: #pfreq=noraman
keyword: PBEPBE/SDD
title: #p freq=noraman PBEPBE/SDD
converged: YES YES NO NO
title: Mulliken charges:
elementType: O O O N C C C C C C H H H H H H H
charge: -0.263201 -0.436165 -0.236941 -0.684007 -0.103488 -0.188436 -0.128930 0.134044 -0.308282 0.288179 0.236528 0.260741 0.198300 0.239721 0.342224 0.309234 0.340477
chargesum: 0.00000
title: Mulliken charges with hydrogens summed into heavy atoms:
elementType: O O O N C C C C C C
charge: -0.263201 -0.093941 -0.236941 -0.034296 0.133040 0.072305 0.069371 0.134044 -0.068560 0.288179
polarizability: 1.13666189e+02 -5.77874920e+00 7.88915608e+01 4.27894163e+00 2.70345412e+00 4.81391053e+01
1716.lowfreq: -9.3420 -0.0006 -0.0004 0.0006 8.2230 13.6445 74.9536 150.5774 183.3902
frequency: 74.9498 150.5752 183.3890 234.5306 251.1240 308.3623 357.5821 371.4216 397.3805 441.0578 466.9028 497.6674 534.4596 631.0681 687.0334 699.1388 754.0797 779.5936 816.7920 863.9268 868.8631 949.0486 978.5535 1048.9652 1067.4538 1113.6709 1178.9700 1185.5888 1221.8649 1271.6839 1306.0583 1332.5401 1355.2358 1394.0958 1411.7788 1565.5620 1612.2509 1660.8113 2882.9998 3085.0014 3138.9678 3141.0224 3537.4829 3543.9597 3696.8087
redmass: 6.9996 4.4485 6.2387 3.8945 1.2398 3.5199 5.2226 1.3284 4.0895 5.1119 5.3502 4.4116 1.0961 5.2531 5.8557 3.6611 9.0498 2.8794 2.8538 3.3790 3.2053 2.9855 2.3642 1.3848 1.3004 1.3630 1.2273 1.7415 1.4784 1.7027 1.2698 1.6275 3.8414 2.0028 3.6523 3.9566 1.4831 6.7240 1.0801 1.0892 1.0908 1.0923 1.0465 1.0660 1.1026
irintensity: 2.3144 6.0837 5.3908 20.9776 120.3526 12.7719 21.5297 143.3431 18.5682 26.9462 2.6727 7.0014 130.5505 19.5887 9.6581 4.8850 22.5550 6.3358 49.5728 8.4732 5.4050 93.8216 30.0071 33.1463 2.6017 7.4327 59.3864 46.2185 12.8828 16.7229 1.9487 0.2770 11.9793 3.6842 25.8522 297.2342 47.8989 191.7691 60.8647 29.6791 23.5592 3.5241 69.3345 4.9340 41.5686
temp: 298.150 k
press: 1.00000 atm
elementType: 8 8 8 7 6 6 6 6 6 6 1 1 1 1 1 1 1
symmnumber: 1
zpe: 329273.8 jmol-1
zpe.correction: 0.125414 hartree
zpe.thermalcorrener: 0.134646 hartree
zpe.thermalcorrenthalpy: 0.135590 hartree
zpe.thermalcorrgfe: 0.091518 hartree
zpe.sumelectzpe: -512.437856 hartree
zpe.sumelectthermal: -512.428624 hartree
zpe.sumelectthermalent: -512.427680 hartree
zpe.sumelectthermalfe: -512.471751 hartree
dipole: -1.5181 1.3543 -2.9556
dipole: 3.5881
quadrupole: -54.1400 -52.9820 -61.2408
quadrupole: 10.4910 8.0540 3.5208
quadrupole: 1.9809 3.1390 -5.1199 10.4910 8.0540 3.5208
hfenergy: -512.5632696 hartree
pointgroup: C01 [X(C6H7N1O3)]
dipole: -0.6076345 -0.6150751 1.1159095 debye
dipolederiv: -0.2359343 0.1132074 0.008994 0.1166627 -0.4441721 0.0710929 -0.0531204 0.183547 -0.5146269 -0.6682068 -0.2407416 -0.1956432 -0.2493908 -0.4678395 0.1369459 -0.2983874 0.0933147 -0.418803 -1.0386247 -0.3231357 -0.0767035 -0.162452 -0.6062977 -0.0291248 -0.0514479 -0.0355391 -0.3379269 -1.020993 0.3395495 0.1242951 0.6637479 -0.4406587 -0.0180523 0.1668857 -0.002346 -0.7320155 0.1538407 -0.1110534 -0.061454 -0.1265897 0.1905856 -0.0087338 -0.07796 -0.0623524 0.230056 -0.1546307 0.0585415 -0.0525793 0.0478734 0.2640834 0.0426302 0.0065065 0.0298233 0.2221206 0.84817 0.1244264 0.1188635 0.0450738 0.2257233 -0.0219275 0.2392074 -0.0343773 0.4561497 1.1751856 0.2909129 0.1074459 0.3192972 0.9372244 -0.0070511 0.114042 0.0266403 0.1458789 -0.3961052 0.3476033 0.0443232 -0.0586717 0.0844168 0.0887103 -0.0650292 0.0558962 -0.2465257 0.8888674 -0.7339557 -0.2581831 -0.7377082 -0.2742155 0.0537721 -0.2637337 0.0293315 0.1426867 -0.0717134 0.1032663 0.093857 0.0657108 0.0084768 -0.0258172 0.085326 0.0004356 0.0341635 0.0397254 -0.0293601 -0.0448733 0.0012553 -0.0580175 -0.062985 -0.024249 -0.0543742 0.0698121 -0.1711788 -0.0319523 0.082591 0.0070695 0.0282158 0.0148969 0.0413392 0.004453 -0.2074045 0.0853563 0.0103284 0.0138082 0.0111847 -0.085495 -0.0420524 0.0624744 -0.0550962 0.1563024 0.1230573 0.120636 0.0659785 0.1893214 0.2506163 -0.1201189 0.1209204 -0.1130551 0.2438881 0.1712842 -0.044852 0.0152235 -0.0734867 0.1634131 -0.0364338 0.0115541 -0.0404272 0.3784373 0.2718999 0.006579 0.0140565 -0.0588976 0.2239404 -0.0357516 -0.0143281 -0.0258741 0.3778072 unknown
polarizability: 113.4305218|6.9673973|78.8972194|-2.4060332|4.4601201|48.3691141 unknown
InChI: InChI=1S/C6H7NO3/c7-2-1-3(8)5-6(10-5)4(2)9/h1,3,5-6,8H,7H2
charge 0 multiplicity 1
17 atoms
O  -0.835335 1.439523 -0.913745
O  -2.648692 -1.107455 -0.332142
O  2.406765 0.996504 0.389515
N  2.110946 -1.620187 -0.276948
C  -1.345294 0.894646 0.384883
C  0.040879 1.475968 0.331061
C  -1.524928 -0.615645 0.497969
C  1.224053 0.551874 0.267326
C  -0.313318 -1.413385 0.095543
C  0.963663 -0.898652 0.010338
H  -2.147561 1.503314 0.826169
H  0.249789 2.478377 0.720926
H  -1.764814 -0.819406 1.570705
H  -0.506161 -2.475084 -0.098722
H  -3.48858 -0.672865 -0.031614
H  2.084435 -2.612796 -0.486518
H  3.000355 -1.122131 -0.260247
