program: Gaussian 09
title: 000145971
version: EM64L-G09RevD.01
frameworkgroup: C1[X(C9H12N2O3S)]
method: RPBEPBE
basis: SDD
operation: Freq
keyword: #p
keyword: freq=noraman
keyword: PBEPBE/SDD
title: #p freq=noraman PBEPBE/SDD
converged: YES YES NO NO
title: Mulliken charges:
elementType: S O O O N N C C C C C C C C C H H H H H H H H H H H H
charge: 0.993875 -0.532373 -0.538473 -0.246769 -0.479835 -0.444685 -0.124913 -0.217111 -0.225650 0.505315 -0.333751 -0.426438 -0.603809 0.222344 -0.796171 0.282177 0.288095 0.320136 0.232215 0.310061 0.315154 0.218072 0.251850 0.275950 0.241014 0.273902 0.239817
chargesum: 0.00000
title: Mulliken charges with hydrogens summed into heavy atoms:
elementType: S O O O N N C C C C C C C C C
charge: 0.993875 -0.532373 -0.538473 -0.246769 -0.169774 -0.129531 -0.124913 0.065066 0.062445 0.505315 -0.013615 -0.194223 0.142063 0.222344 -0.041437
polarizability: 2.29612277e+02 -5.77278447e-01 1.40774860e+02 1.04948274e+00 1.18203885e+01 9.75066660e+01
1716.lowfreq: -67.1350 -10.0657 -4.1059 -0.0013 0.0007 0.0018 1.4173 34.3561 38.9248
frequency: -67.1326 34.3273 38.7107 62.7830 76.8706 98.9292 108.7025 147.9450 171.2729 187.6247 204.6480 214.1910 278.4643 294.0219 330.8020 344.1641 350.7536 382.8168 413.2840 434.7653 461.5558 524.2309 551.5462 583.0343 618.9178 652.1989 670.3267 689.2853 725.5746 808.0421 819.8036 833.1648 866.9864 928.0540 951.9614 959.7226 982.4939 989.6187 997.7085 1033.0711 1033.7794 1050.1987 1094.4692 1102.4537 1119.4560 1181.8322 1217.0746 1263.2150 1292.9443 1332.5232 1368.0845 1379.0526 1404.5771 1415.0166 1446.7142 1466.3443 1468.0047 1473.9641 1482.4221 1504.1741 1593.9935 1599.2335 1640.5910 2939.2953 2989.3030 3051.1174 3074.3096 3096.2909 3122.6330 3138.3968 3156.1827 3159.8744 3197.3666 3448.3748 3521.4772
redmass: 1.0540 5.6211 3.4592 3.5739 4.8119 6.4308 3.0632 2.3667 4.6656 1.7208 5.1144 6.1051 4.8683 6.2749 4.1011 3.8669 4.7751 4.4878 2.9826 7.0629 7.4284 2.8042 4.7697 2.9359 6.9885 1.1871 5.0047 1.9026 3.2986 7.4462 5.5646 1.4295 1.4181 6.3953 7.0328 1.4047 2.1044 3.0410 1.3322 1.6717 2.9345 2.3768 1.4902 1.4676 1.3248 1.1261 3.4244 1.8970 1.4077 1.2316 4.0167 1.2503 4.9251 1.1226 1.1320 1.0538 1.0497 2.2313 1.0559 2.0498 6.4231 5.6053 5.1740 1.0438 1.0385 1.0897 1.0983 1.0994 1.0899 1.0980 1.0912 1.0951 1.0951 1.0765 1.0765
irintensity: 0.0385 7.4330 3.6636 1.1095 4.5284 1.7211 6.3076 5.6612 3.7720 1.3185 16.1201 0.9924 7.4267 10.2534 44.7978 21.7002 23.0489 34.5289 0.0089 13.4444 126.3960 64.5002 71.7860 1.3384 3.2154 62.9873 2.8251 39.9629 0.7271 83.8338 59.9622 29.8870 40.4768 6.8280 69.0894 4.0079 21.7713 6.2028 3.5596 7.9019 5.3387 41.1046 27.5166 20.8360 6.9349 23.4738 62.6957 60.1003 47.2817 1.6067 222.4356 73.8846 13.5622 16.7516 43.7752 25.9101 20.5866 53.4110 16.7847 387.9515 87.0372 32.1074 119.1477 56.7157 6.4277 22.7337 12.9337 2.8974 14.1417 5.9166 1.2343 8.1933 8.7822 19.3101 15.0048
temp: 298.150 k
press: 1.00000 atm
elementType: 16 8 8 8 7 7 6 6 6 6 6 6 6 6 6 1 1 1 1 1 1 1 1 1 1 1 1
symmnumber: 1
zpe: 530227.5 jmol-1
zpe.correction: 0.201953 hartree
zpe.thermalcorrener: 0.217656 hartree
zpe.thermalcorrenthalpy: 0.218600 hartree
zpe.thermalcorrgfe: 0.157686 hartree
zpe.sumelectzpe: -1082.098420 hartree
zpe.sumelectthermal: -1082.082716 hartree
zpe.sumelectthermalent: -1082.081772 hartree
zpe.sumelectthermalfe: -1082.142687 hartree
dipole: -6.7089 1.6803 5.5730
dipole: 8.8821
quadrupole: -101.5002 -95.9631 -97.1694
quadrupole: -22.5178 7.8232 0.4585
quadrupole: -3.2893 2.2478 1.0415 -22.5178 7.8232 0.4585
hfenergy: -1082.3003726 hartree
pointgroup: C01 [X(C9H12N2O3S1)]
dipole: -2.6410134 -0.7749846 -2.1530814 debye
polarizability: 229.4669112|3.1769457|141.2890415|-2.744102|10.9671472|97.1378504 unknown
InChI: InChI=1S/C9H12N2O3S/c1-7(12)11-8-3-5-9(6-4-8)15(13,14)10-2/h3-6,10-11H,1-2H3
charge 0 multiplicity 1
27 atoms
S  3.062177 -0.17132 0.325345
O  3.363233 0.948469 1.462383
O  3.631521 -1.693162 0.352804
O  -3.818516 1.440773 0.444192
N  3.745647 0.540259 -1.223563
N  -2.996731 -0.65305 -0.233457
C  1.179575 -0.292154 0.15791
C  0.389911 0.805586 0.537938
C  0.63346 -1.495938 -0.321266
C  -1.595779 -0.483995 -0.084514
C  -1.011803 0.71603 0.411854
C  -0.764933 -1.585718 -0.440028
C  3.384925 1.940756 -1.509358
C  -4.02547 0.268237 0.023357
C  -5.42227 -0.280952 -0.25952
H  0.857229 1.704419 0.95338
H  1.284907 -2.342652 -0.560837
H  -1.65794 1.547897 0.695831
H  -1.215741 -2.517813 -0.803077
H  3.626577 -0.150466 -1.980336
H  -3.294584 -1.571117 -0.57331
H  2.346409 2.093708 -1.87386
H  4.091969 2.319636 -2.268455
H  3.539266 2.52887 -0.588915
H  -5.54172 -0.539596 -1.328129
H  -6.16083 0.490408 0.00018
H  -5.629588 -1.187214 0.339151
