program: Gaussian 09
title: 000146030
version: EM64L-G09RevD.01
frameworkgroup: C1[X(C20H23NO5)]
method: RPBEPBE
basis: SDD
operation: Freq
keyword: #p
keyword: freq=noraman
keyword: PBEPBE/SDD
title: #p freq=noraman PBEPBE/SDD
converged: YES YES NO NO
title: Mulliken charges:
elementType: O O O O O N C C C C C C C C C C C C C C C C C C C C H H H H H H H H H H H H H H H H H H H H H H H
charge: -0.347657 -0.277153 -0.444451 -0.269844 -0.293076 -0.351942 -0.310977 -0.471170 -0.649303 0.496397 0.477200 0.187579 0.253929 0.048229 -0.669745 -0.581209 -0.306985 0.223869 -0.048443 -0.638569 0.067486 -0.345284 0.206839 -0.506202 -0.503551 -0.509531 0.215780 0.220427 0.231577 0.234712 0.232730 0.284337 0.263944 0.226118 0.243771 0.206454 0.229871 0.217291 0.238605 0.382724 0.259983 0.218778 0.231128 0.226259 0.255518 0.215317 0.282601 0.225053 0.220587
chargesum: 0.00000
title: Mulliken charges with hydrogens summed into heavy atoms:
elementType: O O O O O N C C C C C C C C C C C C C C C C C C C C
charge: -0.347657 -0.277153 -0.061727 -0.269844 -0.293076 -0.067605 -0.095197 -0.019166 -0.181861 0.496397 0.477200 0.187579 0.253929 0.048229 -0.405801 -0.355091 -0.063214 0.223869 -0.048443 0.015046 0.067486 -0.106680 0.206839 0.203687 0.193543 0.218710
polarizability: 4.32090588e+02 7.54538544e+00 2.30653724e+02 -3.94629059e+00 -5.36055262e+00 1.78460727e+02
1716.lowfreq: -8.8517 -5.1820 -0.0009 -0.0002 0.0006 2.9830 15.5329 26.9134 35.0368
frequency: 15.0551 26.7235 34.9857 43.9318 53.6171 63.4335 74.5467 88.9217 89.8911 112.1443 119.5594 137.1459 142.5518 154.5039 161.8922 171.8886 174.9571 209.8047 214.7972 224.2004 244.0424 261.3977 272.2711 287.7870 303.3982 322.1477 340.4361 343.8710 361.9071 373.0799 382.8805 389.9452 409.0169 432.7012 445.5444 464.2292 478.0185 485.6454 529.8387 562.0439 574.9898 603.1531 605.9439 620.8917 647.1110 666.3528 678.0296 724.8854 736.3358 741.8725 760.5135 779.6173 801.5496 835.9266 861.7579 869.1148 877.6548 890.8645 908.7883 921.1252 937.0366 963.8208 977.1733 994.8280 1019.3870 1043.5841 1068.9474 1081.3431 1101.0305 1106.4644 1110.5516 1111.6914 1113.2119 1123.6997 1141.9118 1149.6369 1154.2158 1158.5135 1160.8838 1179.3061 1193.8718 1226.7433 1241.1040 1251.9994 1264.6045 1276.9896 1281.9977 1307.0902 1324.9282 1335.1245 1346.4429 1363.5154 1380.7554 1384.1596 1413.7992 1421.9244 1431.2057 1434.8277 1437.3865 1440.5916 1446.9832 1451.2120 1453.3169 1454.5967 1459.1254 1465.3419 1467.3792 1469.7228 1470.8235 1471.5885 1478.4088 1485.3167 1498.6365 1524.2324 1571.8623 1582.5048 1594.7845 1619.3867 2878.5227 2899.1427 2973.6847 2978.9133 2984.3584 2989.2037 2999.6239 3000.4224 3035.9777 3050.1649 3070.3452 3083.4640 3084.7163 3097.4028 3108.6333 3113.3999 3127.4259 3130.7499 3136.8609 3149.8523 3152.1227 3407.9280 3534.8494
redmass: 2.5791 5.4130 5.2175 3.5964 2.9185 2.2806 2.2863 2.8225 3.3184 1.9962 1.7323 2.3395 2.2114 1.2909 2.7406 1.7840 2.8700 3.3907 3.3952 3.8721 4.1366 3.4579 3.2899 2.8558 4.6896 5.1046 5.3794 2.9742 3.3037 3.8292 4.3771 4.8781 4.0244 5.5418 2.7888 6.1879 4.5301 4.7678 4.9793 4.9793 3.9466 3.9720 2.4985 1.5645 5.4816 6.0294 4.9916 3.8675 4.0533 4.1968 5.4220 4.0840 4.4298 3.4361 1.5056 2.4605 2.6212 2.4710 4.1473 1.6613 6.7230 2.8160 1.3967 3.1569 4.3654 2.3475 2.5531 3.4603 2.0390 1.4450 1.2589 1.3616 1.3508 2.7954 1.4923 1.3909 1.6478 1.6524 2.0520 1.5428 1.8810 4.8711 2.2458 1.8894 1.7814 1.6230 1.3366 2.9875 1.6070 1.3136 1.6333 1.4877 2.2680 2.3557 2.6818 1.3091 1.3552 1.2456 1.1644 1.5249 1.8755 1.1850 1.0623 1.0601 1.0964 1.1333 1.0825 1.1044 1.1328 1.1232 2.5771 3.4376 1.0618 4.5573 5.4417 7.0501 7.1824 6.8925 1.0550 1.0833 1.0625 1.0322 1.0632 1.0323 1.0321 1.0778 1.0975 1.1019 1.0979 1.1008 1.0862 1.0998 1.1006 1.0856 1.1044 1.1056 1.0910 1.0913 1.1051 1.0630 1.0767
irintensity: 5.9244 2.5037 3.3479 3.7067 0.5140 5.4060 1.4681 2.8111 0.8802 0.5094 4.4069 3.2376 0.4254 0.3159 3.3476 2.1400 1.0188 1.6597 8.0223 1.8752 2.6563 1.3219 19.9788 25.6429 18.7614 24.3418 3.1462 22.3348 6.2565 0.3422 1.1425 3.2386 10.5616 6.0157 33.4389 24.0959 7.8804 2.1093 19.6079 6.8225 5.1842 10.6298 22.2256 72.8910 32.2386 7.6446 3.3753 12.2445 2.5395 19.2679 3.8220 1.9557 7.3200 7.0134 27.2812 39.9683 24.3765 4.1439 8.3294 18.1345 5.7351 28.7403 1.0117 31.8936 85.4937 32.6656 2.9534 40.7697 68.4002 4.2158 2.8065 4.8288 4.5417 14.0573 12.2508 3.8372 32.5897 37.4606 7.9190 10.8189 257.7152 458.6321 7.7651 53.7686 187.8531 35.8199 4.8396 83.1347 18.8202 1.4155 47.3569 24.2505 52.2077 19.9381 27.8186 152.7905 11.5854 8.5667 2.8369 29.4112 44.6151 6.0888 21.7050 6.0853 11.9967 10.3599 88.5911 17.3625 25.8486 94.7175 102.4256 140.6742 12.9998 64.2301 39.7585 39.2775 13.9917 120.4592 152.6661 54.5583 52.6743 48.3293 22.4855 100.2348 96.6923 38.8024 34.7461 30.7712 27.1102 23.3055 9.2843 39.9470 41.7682 7.6087 19.6545 21.3018 5.5480 5.6597 6.5574 62.2759 1.6908
temp: 298.150 k
press: 1.00000 atm
elementType: 8 8 8 8 8 7 6 6 6 6 6 6 6 6 6 6 6 6 6 6 6 6 6 6 6 6 1 1 1 1 1 1 1 1 1 1 1 1 1 1 1 1 1 1 1 1 1 1 1
symmnumber: 1
zpe: 1025920.5 jmol-1
zpe.correction: 0.390752 hartree
zpe.thermalcorrener: 0.417350 hartree
zpe.thermalcorrenthalpy: 0.418294 hartree
zpe.thermalcorrgfe: 0.332677 hartree
zpe.sumelectzpe: -1204.779125 hartree
zpe.sumelectthermal: -1204.752527 hartree
zpe.sumelectthermalent: -1204.751583 hartree
zpe.sumelectthermalfe: -1204.837201 hartree
dipole: 2.2445 1.0534 1.2815
dipole: 2.7910
quadrupole: -161.3999 -145.0152 -146.3803
quadrupole: 6.7072 16.7595 -3.2712
quadrupole: -10.4681 5.9166 4.5515 6.7072 16.7595 -3.2712
hfenergy: -1205.1698775 hartree
pointgroup: C01 [X(C20H23N1O5)]
dipole: 0.8528892 0.3574333 0.5920703 debye
polarizability: 431.7141479|6.1990706|231.0776938|11.6618059|0.0413653|178.4131977 unknown
InChI: InChI=1S/C20H23NO5/c1-21-14-7-5-11-9-17(25-3)19(23)20(26-4)18(11)12-6-8-16(24-2)15(22)10-13(12)14/h6,8-10,14,21,23H,5,7H2,1-4H3
charge 0 multiplicity 1
49 atoms
O  1.19603 -2.058183 0.946034
O  5.196338 0.10556 -0.86244
O  3.823864 -2.10293 0.652575
O  -4.796042 -1.636561 -1.138778
O  -5.016839 0.813839 0.316763
N  0.373163 2.095397 1.647083
C  -0.534017 2.445547 0.539518
C  0.2007 3.167053 -0.633266
C  0.837647 2.228962 -1.693628
C  -1.319387 1.19404 0.062309
C  1.635573 1.098613 -1.07202
C  0.94187 0.068263 -0.36493
C  -0.557291 0.023201 -0.33501
C  1.731938 -0.955004 0.209149
C  3.039693 1.064429 -1.176972
C  -2.70885 1.313687 0.126067
C  -1.133488 -1.185745 -0.766738
C  3.820981 0.024085 -0.615155
C  3.145783 -1.009571 0.084383
C  -0.189023 2.134181 3.000283
C  -3.853381 0.429713 -0.093297
C  -2.485765 -1.569376 -0.97133
C  -3.690336 -0.886834 -0.761393
C  0.602615 -1.690728 2.255503
C  6.146257 -0.580796 0.035263
C  -6.111231 -1.020398 -1.444966
H  -1.291741 3.169923 0.917932
H  0.977079 3.824763 -0.192056
H  -0.523952 3.827923 -1.145625
H  0.026779 1.810376 -2.321155
H  1.480376 2.830246 -2.361967
H  1.329186 2.443239 1.551437
H  3.57385 1.847262 -1.725356
H  -3.07753 2.277427 0.510579
H  -0.411491 -1.965698 -1.036327
H  -0.581784 3.136175 3.300168
H  -1.028696 1.417969 3.088626
H  0.580736 1.834436 3.733584
H  -2.629693 -2.572477 -1.394202
H  3.107705 -2.700149 1.014818
H  -0.213333 -0.961906 2.118079
H  1.375863 -1.258182 2.918336
H  0.211574 -2.629597 2.676211
H  7.137282 -0.246696 -0.308357
H  6.051344 -1.674725 -0.042737
H  5.983705 -0.275564 1.085319
H  -6.538805 -0.549619 -0.549665
H  -6.714578 -1.867246 -1.806125
H  -5.999779 -0.262228 -2.240728
