program: Gaussian 09
title: 000145970
version: EM64L-G09RevD.01
frameworkgroup: C1[X(C15H14O3)]
method: RPBEPBE
basis: SDD
operation: Freq
keyword: #pfreq=noraman
keyword: PBEPBE/SDD
title: #p freq=noraman PBEPBE/SDD
converged: YES YES NO NO
title: Mulliken charges:
elementType: O O O C C C C C C C C C C C C C C C H H H H H H H H H H H H H H
charge: -0.253612 -0.436254 -0.439483 -0.275986 -0.571305 -0.353805 0.369974 0.563782 0.191257 -0.381312 -0.519836 -0.501525 -0.518051 -0.427036 0.326319 0.279009 -0.183069 -0.414296 0.250770 0.232130 0.238767 0.212225 0.239364 0.230973 0.254337 0.238888 0.273110 0.218355 0.226278 0.222399 0.351725 0.355908
chargesum: 0.00000
title: Mulliken charges with hydrogens summed into heavy atoms:
elementType: O O O C C C C C C C C C C C C C C C
charge: -0.253612 -0.084530 -0.083575 -0.025216 -0.100408 0.097785 0.369974 0.563782 0.191257 -0.150339 -0.265499 -0.262637 -0.244940 -0.208681 0.326319 0.279009 0.043208 -0.191897
polarizability: 2.64960990e+02 -2.69978534e+00 1.35515284e+02 -7.39216643e-01 -1.32810359e+00 1.19263346e+02
1716.lowfreq: -5.3410 -0.0007 -0.0006 0.0004 0.5974 11.4134 33.6226 38.1464 62.5183
frequency: 33.4754 38.0480 62.5130 121.0335 124.0324 200.6534 221.9182 228.4264 240.5173 264.7113 315.2157 329.3645 338.0875 358.3480 395.0804 417.7415 449.7153 456.2425 472.5578 484.9664 502.0315 519.2960 581.5485 605.3771 610.1493 632.9577 699.7971 701.4296 715.1749 741.9925 774.0203 781.6021 803.8186 862.2458 868.1181 878.3633 887.0156 908.2236 911.0264 924.3833 957.6834 963.6052 985.4907 996.7332 1052.1860 1087.8915 1092.7921 1105.6621 1137.9276 1141.1102 1171.3926 1175.9038 1180.0097 1183.1760 1203.8104 1232.4278 1241.1394 1264.7256 1269.9353 1284.5681 1302.8570 1320.3661 1344.0075 1373.7154 1393.7148 1396.7920 1437.7193 1461.0953 1468.4616 1472.6724 1479.1896 1498.3062 1590.3653 1593.3042 1627.1704 1637.1625 2969.9433 2979.3004 3005.2961 3037.3524 3095.4055 3114.7517 3117.0990 3132.6405 3138.0732 3150.9611 3158.2330 3184.6746 3584.4630 3585.6311
redmass: 4.9239 5.5221 5.0247 3.3984 3.9675 5.3992 5.1348 4.3424 5.5038 3.8063 4.2756 3.3348 1.1486 1.1196 3.1378 4.4683 2.9404 3.4318 4.6360 4.2223 3.9275 7.2892 4.6795 4.7541 4.1490 5.5446 2.6797 2.3402 6.0243 5.1250 1.4119 1.6211 3.8901 1.5297 1.5959 1.5141 1.5722 4.1907 2.5073 1.3847 2.8379 1.3375 6.1756 3.8821 2.1088 2.0441 2.5976 2.0104 1.4507 1.3682 1.3157 1.2201 1.4566 1.4385 1.8504 1.2699 1.4833 3.3067 1.6701 1.7881 1.5119 1.3347 1.3728 1.6130 5.9508 4.3689 2.3972 1.2542 2.5747 1.1617 2.3941 3.1179 7.2630 6.3835 6.3185 6.9179 1.0637 1.0679 1.0814 1.0974 1.0995 1.0869 1.0880 1.0902 1.0970 1.0916 1.0985 1.0926 1.0660 1.0660
irintensity: 1.5928 0.1652 0.9380 3.3409 0.0436 3.9670 3.1150 0.6477 2.8606 4.3640 9.9921 1.6011 143.7031 136.9638 15.5240 6.9258 5.4701 5.0330 3.3506 2.5346 1.3088 1.9796 2.8516 1.3027 15.5664 1.5274 8.5143 21.7009 8.6655 5.5942 37.1634 47.9756 40.4277 41.4973 0.3224 3.0187 19.4600 8.4917 9.3979 6.7337 26.7295 0.7902 7.0329 166.3716 0.8172 28.0851 177.3336 137.3708 152.4567 48.2988 21.9903 6.0378 20.8246 28.7467 1.3990 1.3429 2.1344 31.9530 20.4496 28.3115 26.8847 11.3139 7.5973 12.3262 69.7160 2.7111 79.8929 23.8168 23.8764 8.3069 39.4999 86.2491 37.4210 67.9672 99.0427 121.9382 22.4748 40.8281 25.6714 26.3391 20.4897 13.1832 9.9417 15.7786 20.5257 15.2952 13.1003 0.3694 39.0598 40.4667
temp: 298.150 k
press: 1.00000 atm
elementType: 8 8 8 6 6 6 6 6 6 6 6 6 6 6 6 6 6 6 1 1 1 1 1 1 1 1 1 1 1 1 1 1
symmnumber: 1
zpe: 662971.1 jmol-1
zpe.correction: 0.252512 hartree
zpe.thermalcorrener: 0.267654 hartree
zpe.thermalcorrenthalpy: 0.268599 hartree
zpe.thermalcorrgfe: 0.209788 hartree
zpe.sumelectzpe: -804.373732 hartree
zpe.sumelectthermal: -804.358590 hartree
zpe.sumelectthermalent: -804.357646 hartree
zpe.sumelectthermalfe: -804.416457 hartree
dipole: 3.0150 1.8267 1.9697
dipole: 4.0382
quadrupole: -79.3570 -105.2680 -106.6653
quadrupole: -11.5034 -5.2633 -0.0796
quadrupole: 17.7398 -8.1712 -9.5685 -11.5034 -5.2633 -0.0796
hfenergy: -804.6262445 hartree
pointgroup: C01 [X(C15H14O3)]
dipole: 1.1887784 0.7773885 0.7117549 debye
polarizability: 264.9617905|-2.4135523|135.2153265|-1.4772952|-2.5019935|119.5625026 unknown
InChI: InChI=1S/C15H14O3/c16-13-3-1-2-10(7-13)12-6-11-4-5-14(17)8-15(11)18-9-12/h1-5,7-8,12,16-17H,6,9H2
charge 0 multiplicity 1
32 atoms
O  -1.353725 -1.58535 -0.829366
O  -5.876142 -0.151988 -0.240611
O  4.615192 1.496381 -1.634553
C  0.560267 -0.507702 0.379042
C  -0.230273 0.8224 0.499404
C  0.081685 -1.239793 -0.898338
C  -1.723374 0.596074 0.302614
C  2.072146 -0.317765 0.36116
C  -2.208243 -0.576864 -0.343128
C  -2.682483 1.526292 0.765066
C  2.685914 0.506089 -0.613598
C  2.890019 -0.984426 1.31143
C  -3.588535 -0.815627 -0.512341
C  -4.068153 1.320054 0.601513
C  -4.511899 0.135834 -0.039779
C  4.089197 0.659741 -0.632687
C  4.292377 -0.82346 1.286776
C  4.905682 -0.001463 0.315932
H  0.29279 -1.152352 1.239063
H  0.151702 1.539565 -0.255389
H  -0.039235 1.282528 1.486727
H  0.253393 -0.609909 -1.794853
H  0.592414 -2.206614 -1.031469
H  -2.333767 2.434419 1.272121
H  2.099926 1.043084 -1.367012
H  2.425511 -1.625627 2.069074
H  -3.933841 -1.725712 -1.008275
H  -4.787284 2.06153 0.971239
H  4.91486 -1.338649 2.026474
H  5.996318 0.121905 0.299443
H  -6.439867 0.578438 0.115629
H  5.60143 1.542967 -1.573509
