program: Gaussian 09
title: 000145962
version: EM64L-G09RevD.01
frameworkgroup: C1[X(C9H13Cl2N3O2)]
method: RPBEPBE
basis: SDD
operation: Freq
keyword: #p
keyword: freq=noraman
keyword: PBEPBE/SDD
title: #p freq=noraman PBEPBE/SDD
converged: YES YES NO NO
title: Mulliken charges:
elementType: Cl Cl O O N N N C C C C C C C C C H H H H H H H H H H H H H
charge: -0.078624 -0.083361 -0.252610 -0.237094 -0.096758 -0.399851 -0.353906 -0.523497 -0.320739 -0.324208 0.337566 -0.566221 -0.580167 0.126853 -0.267413 0.159997 0.208838 0.244198 0.236210 0.218860 0.228454 0.224730 0.268591 0.267730 0.245932 0.327841 0.267264 0.367074 0.354310
chargesum: 0.00000
title: Mulliken charges with hydrogens summed into heavy atoms:
elementType: Cl Cl O O N N N C C C C C C C C C
charge: -0.078624 -0.083361 -0.252610 -0.237094 -0.096758 -0.032777 0.000404 -0.070461 0.134331 0.128976 0.337566 -0.029901 -0.006393 0.126853 -0.000149 0.159997
polarizability: 1.94020755e+02 2.17526409e+01 1.40389410e+02 -6.30187375e+00 1.05627963e+01 1.08321654e+02
1716.lowfreq: -8.2451 -2.1047 -0.0025 0.0019 0.0019 6.2269 23.5702 30.1985 40.3915
frequency: 23.0713 30.1124 40.3210 54.1999 66.8441 79.4262 104.2410 108.7747 155.5645 171.1063 198.4478 206.7679 230.7967 295.7998 330.0795 340.6679 366.7506 407.4559 434.9649 467.0439 510.2903 546.0621 572.3678 638.1775 650.2871 659.9450 701.7148 715.9209 742.6458 761.3448 775.6154 782.3429 803.0376 833.2330 900.3942 927.7144 961.5249 994.3642 1000.2730 1042.0950 1048.0224 1097.2212 1116.4861 1128.5621 1173.9596 1200.4070 1225.8321 1240.8460 1248.6101 1260.3085 1275.8584 1307.9253 1330.3901 1340.2261 1356.3665 1363.8305 1370.1169 1379.2796 1387.9734 1442.0925 1445.5910 1446.2467 1458.4859 1460.4473 1472.1313 1610.3733 1652.7961 1686.1151 2905.3752 2965.5292 2974.4391 3026.9109 3038.0671 3051.9591 3060.2397 3063.1228 3150.8379 3156.0099 3157.6800 3521.6381 3561.6021
redmass: 9.5347 11.2702 11.2281 6.5597 3.4237 3.1190 4.1053 2.6594 5.8652 8.0197 4.9303 5.3048 5.4267 3.6047 4.4812 4.1346 10.2232 3.2320 3.2586 2.8934 5.4631 6.0353 5.4946 1.2780 6.4335 5.9144 2.1786 5.0031 4.2252 1.1576 1.5341 1.5431 4.8996 4.3393 1.4881 2.4337 2.4737 1.4996 1.6163 3.8602 3.5060 1.6382 2.0768 1.9512 2.2887 1.5302 4.6010 1.2966 1.2835 1.3686 1.2289 1.3464 1.7515 1.6163 1.4511 1.3028 1.6000 1.3563 2.0561 1.1089 2.3520 1.0962 1.0841 1.0880 1.0994 6.2240 6.3905 5.7138 1.0703 1.0586 1.0595 1.1037 1.1033 1.0907 1.0575 1.0566 1.1123 1.1118 1.0943 1.0771 1.0787
irintensity: 1.2904 1.1816 2.1955 1.7981 0.4719 1.6792 0.1405 2.2396 2.2288 4.4977 5.0606 3.5251 3.3626 4.7511 14.6525 5.4464 21.3772 6.4670 20.9105 6.6605 8.1943 23.2041 0.1420 88.3390 71.2210 117.4628 3.4837 11.8445 35.3841 6.6945 26.0059 84.1855 31.8669 14.6839 15.0005 5.6913 8.3190 5.0095 27.4867 0.5748 0.9181 57.1721 47.0344 10.6591 111.5585 1.2220 11.5061 9.8181 18.3330 11.3239 6.9533 17.5155 77.0074 25.0083 8.8483 1.1897 20.3008 4.5402 58.5078 14.7942 43.1489 19.8514 9.6673 6.3074 20.8286 132.4319 246.7395 768.2649 85.5680 35.2808 45.8954 14.4694 26.3090 7.6712 16.8849 21.4388 21.4757 10.0142 4.8690 58.4481 95.9593
temp: 298.150 k
press: 1.00000 atm
elementType: 17 17 8 8 7 7 7 6 6 6 6 6 6 6 6 6 1 1 1 1 1 1 1 1 1 1 1 1 1
symmnumber: 1
zpe: 584924.3 jmol-1
zpe.correction: 0.222786 hartree
zpe.thermalcorrener: 0.239593 hartree
zpe.thermalcorrenthalpy: 0.240537 hartree
zpe.thermalcorrgfe: 0.174781 hartree
zpe.sumelectzpe: -1584.379271 hartree
zpe.sumelectthermal: -1584.362463 hartree
zpe.sumelectthermalent: -1584.361519 hartree
zpe.sumelectthermalfe: -1584.427276 hartree
dipole: 2.5567 1.6792 4.4298
dipole: 5.3833
quadrupole: -127.6450 -125.3877 -103.8789
quadrupole: -1.7616 7.7943 2.8622
quadrupole: -8.6744 -6.4172 15.0916 -1.7616 7.7943 2.8622
hfenergy: -1584.6020564 hartree
pointgroup: C01 [X(C9H13Cl2N3O2)]
dipole: 0.8450418 0.2459797 1.9264115 debye
polarizability: 184.1069715|30.9236637|140.6094291|2.3906414|20.2205854|118.0154184 unknown
InChI: InChI=1S/C9H13Cl2N3O2/c10-1-3-14(4-2-11)6-7-5-12-9(16)13-8(7)15/h5,12-13H,1-4,6H2
charge 0 multiplicity 1
29 atoms
Cl -1.339523 3.981352 0.359153
Cl -4.53162 -2.057994 -1.523909
O  0.217729 -1.98872 -1.23991
O  4.350043 0.217376 -1.219097
N  -1.718425 -0.131781 0.859586
N  2.257692 -0.861294 -1.197765
N  2.917111 0.46386 0.622486
C  -0.578965 -0.901718 1.38905
C  -1.765795 1.305237 1.137713
C  -2.937662 -0.837159 0.438288
C  0.743431 -0.609632 0.699575
C  -1.383983 2.137736 -0.10223
C  -2.936398 -1.129926 -1.07491
C  1.000735 -1.209816 -0.621551
C  1.715253 0.183862 1.265306
C  3.259735 -0.042715 -0.650103
H  -0.455354 -0.720389 2.482211
H  -0.809601 -1.973503 1.253772
H  -2.776533 1.607591 1.477802
H  -1.064452 1.552323 1.959645
H  -3.040494 -1.79544 0.985039
H  -3.826021 -0.226131 0.690961
H  -0.376437 1.894869 -0.469303
H  -2.124182 2.055146 -0.911788
H  -2.952245 -0.210052 -1.679012
H  -2.101546 -1.779613 -1.371948
H  1.586894 0.636008 2.25357
H  2.467134 -1.267006 -2.116077
H  3.623077 1.06253 1.055145
