program: Gaussian 09
title: 000146171
version: EM64L-G09RevD.01
frameworkgroup: C1[X(C18H16N6O6S2)]
method: RPBEPBE
basis: SDD
operation: Freq
keyword: #p
keyword: freq=noraman
keyword: PBEPBE/SDD
title: #p freq=noraman PBEPBE/SDD
converged: YES YES NO NO
title: Mulliken charges:
elementType: S S O O O O O O N N N N N N C C C C C C C C C C C C C C C C C C H H H H H H H H H H H H H H H H
charge: 0.994341 0.991859 -0.568115 -0.568987 -0.502475 -0.501498 -0.504917 -0.505412 -0.101418 -0.119217 -0.620893 -0.249966 -0.143594 -0.636045 -0.081144 0.247226 0.034451 0.399466 -0.075779 -0.071442 -0.241814 -0.422517 0.279707 0.197377 -0.204912 -0.201288 -0.207393 -0.211686 -0.345312 -0.288878 -0.271876 -0.331456 0.280848 0.235272 0.285213 0.281476 0.279724 0.284442 0.253443 0.256909 0.261417 0.262740 0.383992 0.334374 0.323397 0.345013 0.383708 0.381641
chargesum: 0.00000
title: Mulliken charges with hydrogens summed into heavy atoms:
elementType: S S O O O O O O N N N N N N C C C C C C C C C C C C C C C C C C
charge: 0.994341 0.991859 -0.184407 -0.187347 -0.502475 -0.501498 -0.504917 -0.505412 -0.101418 -0.119217 0.097473 -0.249966 -0.143594 0.032364 -0.081144 0.247226 0.034451 0.399466 -0.075779 -0.071442 0.039034 -0.187245 0.279707 0.197377 0.080301 0.080188 0.072331 0.072756 -0.091868 -0.031969 -0.010459 -0.068716
polarizability: 9.13751238e+02 -1.96014336e+01 4.05402759e+02 4.92342643e-01 -3.46305599e-02 1.54276721e+02
1716.lowfreq: -6.0612 -3.6364 -2.3221 -0.0018 -0.0015 0.0004 2.3176 3.9426 18.8270
frequency: -3.1471 -1.2130 18.8050 23.7405 29.2829 35.9538 38.3150 55.4864 63.1607 85.2046 102.5792 122.6714 128.1782 132.4608 134.8681 159.5320 172.6384 173.3553 191.2858 193.4850 211.6686 232.1988 239.5510 259.2045 276.5529 280.2841 285.4921 291.6427 309.2348 319.5522 353.8726 356.3523 360.2761 360.9569 370.3937 384.3639 391.9104 413.6745 415.1757 422.1465 431.5999 452.7427 485.8022 487.1545 511.0007 516.9186 526.7300 534.1656 555.9444 560.4471 588.2578 590.6005 615.6348 618.9144 619.9306 635.3475 675.7293 678.2694 721.1709 727.7756 732.6588 736.7381 783.7484 793.0379 822.4745 831.4912 832.8913 836.7080 839.4635 849.7028 856.2931 859.9161 888.3624 907.5371 964.3592 965.6757 969.4973 976.4378 978.1978 981.9603 983.9208 984.4032 987.0451 988.3400 990.2306 1040.7238 1041.9356 1052.4449 1053.8842 1101.5475 1105.6139 1114.4052 1138.2411 1150.9337 1171.5936 1179.0633 1205.5119 1242.4952 1269.7952 1280.7489 1286.1294 1293.9413 1327.5164 1335.2612 1376.7120 1387.9367 1390.8814 1407.8903 1408.0046 1432.2113 1442.9700 1455.4750 1456.9116 1496.4826 1524.8507 1571.1142 1576.5465 1580.9881 1586.5731 1589.0499 1593.9103 1613.2747 3142.4555 3156.1785 3156.4305 3158.1700 3158.5616 3167.0644 3171.2015 3175.1108 3176.6111 3180.3485 3185.4533 3479.6308 3480.0565 3504.4781 3555.1418 3672.8092
redmass: 6.8624 6.2213 10.4752 6.4094 8.1610 4.7312 4.4241 7.9432 7.1240 5.9346 9.8056 6.8235 7.8984 7.7788 8.6306 7.5525 1.6499 1.5217 6.4161 6.7953 4.6535 7.1027 4.5657 7.3057 5.7267 3.5995 4.0042 4.8774 9.2987 9.2832 6.1009 6.1357 5.0438 7.4722 5.2302 5.7306 5.7937 3.1442 3.2356 9.0217 9.1147 4.3429 6.4430 1.3559 2.8795 5.8858 5.1559 6.0548 8.1656 5.9529 4.0692 4.8355 7.2261 6.7759 1.9999 7.2493 1.4709 6.1064 1.4266 4.7218 3.1292 3.6165 6.9737 6.0629 1.5475 12.8338 13.0514 1.2475 1.2529 6.1314 1.6402 1.6396 6.6479 1.1230 8.3264 12.1088 4.0145 1.4022 1.3611 1.3667 4.0514 3.3698 1.4189 1.4081 1.9456 1.7271 1.6099 1.4715 1.5792 1.4810 1.3584 1.4871 1.9544 1.3393 1.4325 1.6340 3.1746 3.2397 1.9577 1.5388 1.4470 2.5384 9.5981 5.9732 3.8509 6.1000 6.5215 4.2197 4.2300 5.7494 1.8669 2.2932 2.2708 3.3079 2.3751 4.8635 5.0425 3.2320 6.1210 6.9709 3.5707 2.5287 1.0883 1.0893 1.0885 1.0897 1.0885 1.0955 1.0687 1.0938 1.0969 1.0955 1.0941 1.0661 1.0661 1.0464 1.0885 1.1021
irintensity: 0.7488 0.4661 0.5973 0.1911 0.1370 1.9176 1.2974 0.1778 0.7747 0.1496 0.5130 0.1730 0.1558 0.4592 0.1089 5.1062 60.6056 42.9848 17.0631 5.3302 16.5016 3.9181 3.2354 6.9903 38.3097 106.7109 38.2460 10.5234 5.0613 9.2746 13.1714 37.9339 18.3280 5.6763 42.6391 2.8186 8.0020 1.1446 0.1915 59.7441 71.4029 30.4766 54.9556 62.3623 39.7245 23.9378 178.0656 14.6509 56.7809 395.2654 7.4691 41.2673 2.0253 10.7064 28.8973 10.6307 104.6928 88.3333 84.1332 2.5521 13.9382 3.0007 8.5824 23.3598 40.5290 232.7971 24.9709 0.8436 1.8842 28.5859 32.4151 70.8608 3.2374 112.8003 108.3299 51.4650 36.8525 1.6222 0.2004 0.6628 2.6057 2.6450 0.9033 0.5185 9.7602 30.0940 30.6572 270.8327 99.4093 57.8435 1.2755 117.6297 48.7573 47.4491 23.7696 24.9305 22.2261 91.9488 166.7357 5.7911 93.8108 43.6570 1566.8995 362.3839 142.1257 0.7790 27.0152 33.2167 9.7108 31.3709 180.3535 26.2077 28.8519 130.8741 23.7347 282.8575 81.8154 122.8626 153.8122 22.9934 25.3596 947.3582 10.4154 1.1733 2.5186 3.9057 1.9765 9.0443 129.5926 5.3413 2.3124 0.4834 3.2259 47.0832 49.7834 185.0197 92.1142 79.1684
temp: 298.150 k
press: 1.00000 atm
elementType: 16 16 8 8 8 8 8 8 7 7 7 7 7 7 6 6 6 6 6 6 6 6 6 6 6 6 6 6 6 6 6 6 1 1 1 1 1 1 1 1 1 1 1 1 1 1 1 1
symmnumber: 1
zpe: 861753.9 jmol-1
zpe.correction: 0.328225 hartree
zpe.thermalcorrener: 0.357655 hartree
zpe.thermalcorrenthalpy: 0.358599 hartree
zpe.thermalcorrgfe: 0.266286 hartree
zpe.sumelectzpe: -2268.806732 hartree
zpe.sumelectthermal: -2268.777302 hartree
zpe.sumelectthermalent: -2268.776358 hartree
zpe.sumelectthermalfe: -2268.868671 hartree
dipole: -2.9911 6.6615 0.0078
dipole: 7.3022
quadrupole: -297.4210 -171.2930 -211.3568
quadrupole: -7.2643 -33.3131 1.3582
quadrupole: -70.7307 55.3973 15.3335 -7.2643 -33.3131 1.3582
hfenergy: -2269.1349569 hartree
pointgroup: C01 [X(C18H16N6O6S2)]
dipole: 1.1896335 -2.4414879 0.9367856 debye
polarizability: 910.8528597|-33.9829089|369.4350183|-38.3797398|-87.0859959|193.1428394 unknown
InChI: InChI=1S/C18H16N6O6S2/c19-15-9-10-16(23-21-11-1-5-13(6-2-11)31(25,26)27)17(20)18(15)24-22-12-3-7-14(8-4-12)32(28,29)30/h1-10,25,28H,19-20H2
charge 0 multiplicity 1
48 atoms
S  8.448673 1.568418 -1.330904
S  -8.41676 2.098974 -0.110324
O  8.758201 2.397549 0.305238
O  -8.642838 1.647911 -1.902838
O  9.443637 0.29809 -1.456493
O  8.409999 2.704255 -2.482718
O  -9.654484 1.482562 0.730999
O  -8.070904 3.678174 -0.025615
N  2.593725 -1.428191 0.41627
N  -2.29637 -0.79059 0.547882
N  0.177455 0.188714 -0.082235
N  2.778495 -0.224596 -0.116281
N  -3.479884 -1.298161 0.839101
N  2.322647 -3.880937 1.474875
C  1.295454 -1.829177 0.690401
C  0.089646 -1.054781 0.458463
C  -1.197894 -1.617796 0.804973
C  1.178215 -3.15871 1.263734
C  6.719189 0.995622 -0.92952
C  -6.87775 1.079802 0.155021
C  -1.257181 -2.92664 1.365083
C  -0.107338 -3.685958 1.593329
C  4.140981 0.119757 -0.362614
C  -4.578244 -0.42536 0.578987
C  5.648805 1.844232 -1.256935
C  6.563612 -0.268602 -0.331323
C  -5.632251 1.685358 -0.099365
C  -7.030976 -0.23932 0.614109
C  4.347853 1.390418 -0.968469
C  5.258883 -0.707524 -0.049182
C  -4.47331 0.921712 0.119084
C  -5.860273 -0.990382 0.830452
H  -2.248461 -3.319155 1.61312
H  -0.180515 -4.689496 2.025372
H  5.828677 2.813091 -1.732356
H  7.438852 -0.887905 -0.11117
H  -5.581806 2.724424 -0.43983
H  -8.025556 -0.651869 0.808018
H  3.477072 2.009551 -1.204607
H  5.087075 -1.681122 0.415392
H  -3.482062 1.346314 -0.058985
H  -5.909217 -2.022323 1.190431
H  1.137219 0.523024 -0.304814
H  -0.695742 0.699721 -0.230713
H  2.296506 -4.816504 1.871958
H  3.210292 -3.447364 1.215957
H  9.680253 2.78782 0.276081
H  -9.4560 2.13107 -2.232439
