program: Gaussian 09
title: 000145960
version: EM64L-G09RevD.01
frameworkgroup: C1[X(C14H26N4O2)]
method: RPBEPBE
basis: SDD
operation: Freq
keyword: #p
keyword: freq=noraman
keyword: PBEPBE/SDD
title: #p freq=noraman PBEPBE/SDD
converged: YES YES NO NO
title: Mulliken charges:
elementType: O O N N N N C C C C C C C C C C C C C C H H H H H H H H H H H H H H H H H H H H H H H H H H
charge: -0.280489 -0.300832 -0.109998 -0.101193 -0.373867 -0.371341 -0.423611 -0.421623 -0.411490 -0.427737 -0.508147 -0.554099 -0.343389 -0.395314 -0.407402 -0.372715 0.287578 0.309794 -0.386538 -0.407981 0.245761 0.208299 0.203159 0.317298 0.268337 0.227770 0.229264 0.213894 0.164076 0.259768 0.283420 0.208043 0.196566 0.185879 0.254655 0.183434 0.198376 0.208016 0.236763 0.194379 0.255536 0.219307 0.201806 0.248949 0.287684 0.299956
chargesum: 0.00000
title: Mulliken charges with hydrogens summed into heavy atoms:
elementType: O O N N N N C C C C C C C C C C C C C C
charge: -0.280489 -0.300832 -0.109998 -0.101193 -0.086183 -0.071385 0.030449 0.098834 0.084617 0.015421 -0.084303 -0.062636 0.039056 0.042775 -0.001010 0.058427 0.287578 0.309794 0.088305 0.042773
polarizability: 2.08217901e+02 1.39972741e+01 1.76182672e+02 -1.59492612e+00 -4.52317012e+00 1.58839505e+02
1716.lowfreq: -16.2590 -10.6851 -9.0572 -0.0006 -0.0005 0.0003 6.9427 34.6402 41.5775
frequency: -14.7523 34.5833 40.9460 47.5328 61.8603 67.7431 75.3818 83.7836 87.8951 105.8066 118.9286 128.3934 158.2634 163.5438 178.1438 207.0482 246.2601 260.9697 271.2624 296.4947 331.1634 336.7246 349.6819 359.4309 368.8252 406.2047 411.6660 499.3766 503.4981 536.0856 569.3709 585.5808 597.9741 678.1225 696.5803 723.7203 738.4005 743.5834 776.1649 796.1427 798.5170 809.4602 829.3655 831.0897 852.7105 877.3170 893.9450 901.3155 948.9938 966.6361 975.5955 977.0997 992.0173 999.7124 1008.8485 1013.3207 1030.7437 1056.5944 1062.7418 1080.3846 1083.6875 1093.5210 1099.6819 1102.7159 1110.5067 1115.9523 1127.5112 1137.6922 1147.4438 1151.0360 1161.5467 1187.1839 1207.4119 1217.4499 1241.3295 1249.3653 1253.2603 1258.1440 1265.1229 1274.3569 1283.9276 1289.7901 1311.9680 1337.6817 1346.2746 1352.4434 1356.2559 1359.0810 1367.5670 1370.7516 1440.8990 1445.9001 1447.7460 1457.0362 1457.6331 1460.1737 1464.5283 1467.4900 1469.4901 1472.8128 1484.6306 1486.7386 1488.2516 1490.3447 1610.8504 1618.2436 2852.2917 2915.2155 2953.0917 2958.8025 2967.4473 2976.7163 2991.0078 2999.1001 3006.6419 3015.4129 3021.3312 3026.0129 3031.7614 3039.8405 3051.1124 3056.7392 3058.6176 3065.1637 3069.8700 3076.1270 3162.5838 3164.5631 3177.2422 3186.3704 3539.1453 3561.2897
redmass: 3.4384 5.0422 3.9456 4.8356 4.8772 3.8722 6.0513 3.5671 4.0710 3.6146 3.4833 2.3125 2.7103 2.7310 3.0383 2.5322 3.4820 2.9066 3.6612 2.6557 2.8583 2.6570 4.3742 3.1211 2.9514 2.3400 2.4983 1.9876 1.8126 1.6381 2.4720 3.0634 1.4369 3.9274 3.7057 1.2841 3.5146 3.2116 1.5233 2.2459 1.7879 1.4952 2.4199 2.2052 2.7416 2.5567 2.5302 3.0961 2.0789 1.7527 1.9736 1.6133 1.3402 1.3999 2.0047 1.9220 1.8281 1.5988 1.7374 1.3019 1.3072 1.2985 2.9801 2.4598 2.3785 2.2081 2.0422 1.6958 1.4005 1.3721 1.4519 1.4342 1.4070 1.5334 1.3651 1.2792 1.4141 2.7202 3.4386 1.5158 1.1848 1.2052 1.1328 1.3142 1.3355 1.3932 1.3157 1.3773 1.4572 1.4549 1.0980 1.1322 1.1295 1.0910 1.1253 1.0956 1.0806 1.0931 1.0976 1.1504 1.2235 1.3427 1.2920 1.6814 6.2591 6.4959 1.0699 1.0646 1.0629 1.0617 1.0620 1.0630 1.0669 1.0603 1.0968 1.0942 1.0976 1.0871 1.0974 1.0541 1.1021 1.0519 1.0599 1.1040 1.0578 1.0965 1.1147 1.1162 1.1152 1.1176 1.0770 1.0781
irintensity: 2.7085 3.2314 0.4685 7.6448 1.5603 6.2779 2.3934 3.7975 2.9242 10.8104 1.4371 0.7008 2.5212 9.6072 2.8776 3.4780 3.2057 2.0303 0.4336 4.5135 1.6783 2.9250 3.4719 4.5690 6.3261 4.5472 3.8269 17.0361 45.1666 109.4264 44.6820 3.7616 60.5535 8.3878 5.1045 14.2972 9.8976 13.6018 4.3768 0.5180 3.1662 8.0660 5.7662 4.6127 2.5980 2.5809 2.8415 2.4232 11.8692 15.2265 1.5560 4.9215 3.6320 10.7590 18.8789 6.1274 1.2089 5.4239 3.9096 1.6062 17.4272 21.9622 8.4317 12.0120 1.4831 1.6400 11.6865 1.3093 0.1007 5.4324 2.2325 4.8759 93.6896 11.0302 5.5921 26.7892 19.6160 1.1988 21.4244 47.7511 5.8435 7.8867 1.9519 8.7003 2.4153 10.2105 4.2330 3.9801 9.4772 17.9802 14.7651 19.4645 25.5806 5.5495 44.7472 4.6005 2.8146 8.2692 38.1652 6.3393 11.1604 19.8892 53.1279 242.9228 99.5014 203.1087 115.2239 12.7276 8.5932 41.3119 33.9308 47.8615 72.1612 54.5429 23.8005 30.5585 47.1372 14.5944 11.7447 33.7085 63.9647 33.5161 48.4380 47.6840 21.6991 9.5711 12.5350 17.4029 14.7063 26.3000 11.4752 16.3364
temp: 298.150 k
press: 1.00000 atm
elementType: 8 8 7 7 7 7 6 6 6 6 6 6 6 6 6 6 6 6 6 6 1 1 1 1 1 1 1 1 1 1 1 1 1 1 1 1 1 1 1 1 1 1 1 1 1 1
symmnumber: 1
zpe: 1035346.8 jmol-1
zpe.correction: 0.394343 hartree
zpe.thermalcorrener: 0.415784 hartree
zpe.thermalcorrenthalpy: 0.416728 hartree
zpe.thermalcorrgfe: 0.343153 hartree
zpe.sumelectzpe: -916.856305 hartree
zpe.sumelectthermal: -916.834864 hartree
zpe.sumelectthermalent: -916.833920 hartree
zpe.sumelectthermalfe: -916.907495 hartree
dipole: 6.5881 -3.0677 -0.2835
dipole: 7.2728
quadrupole: -119.8016 -107.0781 -123.3915
quadrupole: 4.4524 2.4075 -8.8506
quadrupole: -3.0445 9.6789 -6.6344 4.4524 2.4075 -8.8506
hfenergy: -917.2506482 hartree
pointgroup: C01 [X(C14H26N4O2)]
dipole: -2.8505206 -0.0883009 -0.23243 debye
polarizability: 190.758844|20.9893362|194.3257265|-0.8695209|2.7985623|158.1555072 unknown
InChI: InChI=1S/C14H26N4O2/c19-13(11-17-7-8-17)15-5-3-1-2-4-6-16-14(20)12-18-9-10-18/h15-16H,1-12H2
charge 0 multiplicity 1
46 atoms
O  -0.889434 0.443351 -1.706722
O  1.977288 -0.531283 1.396923
N  -0.27511 2.374039 0.413538
N  3.57179 0.788941 -0.67877
N  -3.060714 0.509953 -0.865052
N  1.557502 -2.184019 -0.176045
C  -0.209662 3.275885 1.624144
C  -0.320238 1.767848 1.799722
C  3.297373 2.09351 0.032315
C  3.67737 2.095446 -1.439674
C  -1.557832 2.38925 -0.336203
C  2.357335 -0.011098 -0.996547
C  -2.801975 -2.078772 0.723761
C  -1.45603 -2.615519 0.184143
C  -3.879594 -1.82391 -0.356124
C  -0.405204 -2.763354 1.306041
C  -1.786762 1.03183 -1.030616
C  1.973884 -0.914342 0.184752
C  -3.479643 -0.783425 -1.435034
C  1.009281 -3.143343 0.801144
H  0.749346 3.779051 1.781966
H  -1.094961 3.880007 1.870512
H  -1.285155 1.37844 2.157819
H  0.5565 1.162334 2.05061
H  2.250139 2.318469 0.269154
H  4.034993 2.36171 0.794925
H  4.690741 2.366349 -1.752786
H  2.883467 2.342804 -2.158438
H  -2.43999 2.638469 0.307608
H  -1.480534 3.169464 -1.117324
H  1.458903 0.607833 -1.226977
H  2.58508 -0.626136 -1.888684
H  -3.210377 -2.790208 1.470269
H  -2.606952 -1.134107 1.272274
H  -1.060892 -1.917881 -0.578209
H  -1.618928 -3.59274 -0.318785
H  -4.820282 -1.498627 0.135663
H  -4.117757 -2.769837 -0.883885
H  -0.320318 -1.808399 1.858535
H  -0.729434 -3.531444 2.037937
H  -2.625142 -1.141352 -2.03334
H  -4.330322 -0.624639 -2.126923
H  0.995658 -4.140271 0.321736
H  1.69801 -3.186353 1.664953
H  -3.727075 1.019792 -0.281226
H  1.558657 -2.432217 -1.165782
