program: Gaussian 09
title: 000145952
version: EM64L-G09RevD.01
frameworkgroup: C1[X(C14H15N3O)]
method: RPBEPBE
basis: SDD
operation: Freq
keyword: #p
keyword: freq=noraman
keyword: PBEPBE/SDD
title: #p freq=noraman PBEPBE/SDD
converged: YES YES NO NO
title: Mulliken charges:
elementType: O N N N C C C C C C C C C C C C C C H H H H H H H H H H H H H H H
charge: -0.239947 -0.532336 -0.446373 -0.000049 -0.301669 -0.565342 0.470904 0.140816 -0.407775 -0.415326 0.479633 -0.225215 -0.237536 -0.246001 -0.349017 -0.430971 -0.155144 -0.357342 0.245552 0.253975 0.225394 0.287446 0.275309 0.244151 0.243383 0.323955 0.231899 0.230701 0.233437 0.236696 0.313697 0.230538 0.242557
chargesum: 0.00000
title: Mulliken charges with hydrogens summed into heavy atoms:
elementType: O N N N C C C C C C C C C C C C C C
charge: -0.239947 0.030419 -0.122418 -0.000049 -0.056117 -0.085973 0.470904 0.140816 -0.163623 -0.171943 0.479633 0.006684 -0.006835 -0.012564 -0.112322 -0.117274 0.075393 -0.114785
polarizability: 1.80379919e+02 2.47860944e+01 1.98567508e+02 -2.19902985e+01 1.51381994e+01 1.23005645e+02
1716.lowfreq: -10.3514 -8.4614 -0.0005 0.0002 0.0004 3.2524 18.4011 25.4224 34.2811
frequency: 18.0926 25.3357 34.2545 52.9314 85.3787 93.8982 121.1085 164.5915 190.0834 233.6669 255.0638 305.9531 322.5884 341.0090 349.0229 377.0211 402.8374 403.7968 493.7042 516.2211 577.5820 599.4518 616.4291 618.2109 661.2468 668.9505 704.4051 707.2007 716.2981 749.1357 765.7330 811.2257 812.9546 820.0331 858.2522 872.7308 909.3782 921.2953 944.2824 950.0696 972.4864 978.6822 988.7376 991.1027 995.1270 999.2272 1026.4542 1028.4910 1073.8947 1121.1050 1126.2150 1141.1476 1159.8278 1173.0145 1188.4373 1193.5123 1197.9372 1215.8973 1259.3560 1279.5254 1309.6823 1314.6163 1328.7922 1335.2250 1365.9128 1379.7105 1407.3358 1439.7623 1457.0908 1473.0103 1483.7877 1499.4485 1569.3227 1586.9758 1589.5148 1611.8865 1622.9740 1658.8550 2993.9077 3002.9720 3063.7504 3112.6160 3118.4395 3124.0721 3135.0349 3135.5091 3147.0621 3164.3829 3165.0107 3190.8680 3419.7812 3480.0807 3535.0088
redmass: 4.7994 5.1720 4.1612 5.7312 5.0189 4.0175 5.0659 3.4365 1.3236 4.2637 4.1734 3.2536 4.3600 2.5878 3.8287 5.0971 2.8532 3.2188 3.3203 3.4589 5.5875 6.3180 6.3109 6.2610 1.9835 1.5700 3.7435 1.9401 2.0276 1.5709 1.9275 4.9148 1.7331 4.4820 1.2479 4.4578 1.3388 1.5037 1.4457 1.9988 1.3833 1.4648 2.9548 3.4406 3.9569 1.4178 2.1998 2.9431 1.5277 1.5748 1.4942 2.3264 1.9897 1.0551 1.1245 1.4099 1.3402 2.7704 2.2453 1.4267 1.7926 2.9704 1.4084 1.2909 1.3101 7.1139 2.1756 2.1420 2.3535 1.1355 2.1942 2.2306 4.1592 5.4968 5.9426 6.0826 4.7393 1.0863 1.0781 1.0662 1.1031 1.0878 1.0900 1.0867 1.0910 1.0898 1.0957 1.0994 1.1013 1.0939 1.0458 1.0767 1.0945
irintensity: 6.6415 0.4458 0.4872 0.5778 1.6046 1.9302 0.4404 7.7217 42.3629 7.7629 0.2111 24.7978 4.5028 0.3160 19.0552 8.2193 0.4365 2.9908 21.7471 1.7688 1.4495 3.3962 1.4009 2.1731 29.7626 60.5836 3.8950 44.5827 46.5798 267.0855 106.6491 7.5227 60.8780 3.6113 0.5442 14.3998 0.4505 4.6035 11.7227 2.9854 0.6385 1.0592 6.6419 3.6176 8.1906 3.0912 4.3196 0.9492 13.5827 19.6195 13.4815 16.6827 23.2739 0.2635 1.5904 4.2844 11.6983 0.3755 28.1644 13.7520 13.4115 33.5056 15.1753 0.4678 10.9315 0.0223 114.3207 7.1157 69.1389 13.5862 12.8199 204.8671 63.6969 30.3755 1.4994 7.5427 139.4249 40.6926 4.5734 36.3504 11.5474 7.3692 10.3954 3.1335 8.7031 13.8653 32.7346 22.4966 20.9986 1.4358 2.1135 26.7428 4.0082
temp: 298.150 k
press: 1.00000 atm
elementType: 8 7 7 7 6 6 6 6 6 6 6 6 6 6 6 6 6 6 1 1 1 1 1 1 1 1 1 1 1 1 1 1 1
symmnumber: 1
zpe: 696250.5 jmol-1
zpe.correction: 0.265188 hartree
zpe.thermalcorrener: 0.281395 hartree
zpe.thermalcorrenthalpy: 0.282339 hartree
zpe.thermalcorrgfe: 0.218739 hartree
zpe.sumelectzpe: -780.680856 hartree
zpe.sumelectthermal: -780.664649 hartree
zpe.sumelectthermalent: -780.663705 hartree
zpe.sumelectthermalfe: -780.727305 hartree
dipole: 2.6692 -3.8936 -2.6890
dipole: 5.4328
quadrupole: -120.9488 -101.2066 -101.5423
quadrupole: 8.1427 2.0372 -1.1409
quadrupole: -13.0496 6.6927 6.3569 8.1427 2.0372 -1.1409
hfenergy: -780.9460443 hartree
pointgroup: C01 [X(C14H15N3O1)]
dipole: -1.1200188 1.4635069 -1.0827362 debye
polarizability: 177.543063|24.0794294|200.7484734|22.8662118|-14.6885573|123.6615357 unknown
InChI: InChI=1S/C14H15N3O/c15-13(9-11-5-2-1-3-6-11)14(18)17-12-7-4-8-16-10-12/h1-8,10,13,17H,9,15H2
charge 0 multiplicity 1
33 atoms
O  0.687993 -2.707859 0.62401
N  -1.761112 -3.601976 -0.471924
N  0.554532 -0.683439 -0.56186
N  4.127611 -0.22924 0.514767
C  -1.44239 -2.167468 -0.499439
C  -2.427533 -1.398757 0.446587
C  -2.363769 0.114911 0.312122
C  0.037183 -1.88795 -0.089571
C  -1.803643 0.925363 1.332813
C  -2.84542 0.749163 -0.865634
C  1.836527 -0.115971 -0.336329
C  -1.72107 2.328849 1.18297
C  -2.762719 2.151591 -1.021405
C  -2.197186 2.947234 0.003441
C  2.074901 1.20232 -0.809388
C  2.900458 -0.795342 0.328075
C  3.342096 1.784384 -0.616114
C  4.341149 1.035049 0.048143
H  -1.609073 -1.799912 -1.531401
H  -3.43174 -1.777136 0.181827
H  -2.223724 -1.708145 1.489364
H  -1.481395 -4.023855 0.424767
H  -1.318495 -4.118381 -1.242397
H  -1.425459 0.452078 2.24695
H  -3.306492 0.141327 -1.655099
H  -0.112409 -0.079886 -1.054556
H  -1.286214 2.936978 1.983893
H  -3.148497 2.623525 -1.932216
H  -2.137269 4.035069 -0.112194
H  1.275649 1.76132 -1.312543
H  2.751826 -1.803936 0.717496
H  3.552877 2.798447 -0.970021
H  5.34131 1.448744 0.217966
