program: Gaussian 09
title: 000145932
version: EM64L-G09RevD.01
frameworkgroup: C1[X(C7H14N2O4S)]
method: RPBEPBE
basis: SDD
operation: Freq
keyword: #p
keyword: freq=noraman
keyword: PBEPBE/SDD
title: #p freq=noraman PBEPBE/SDD
converged: YES YES NO NO
title: Mulliken charges:
elementType: S O O O O N N C C C C C C C H H H H H H H H H H H H H H
charge: 0.180344 -0.425021 -0.216678 -0.406029 -0.230700 -0.565676 -0.574536 -0.524073 -0.365556 -0.635308 -0.199735 -0.381457 0.239622 0.181210 0.299721 0.252767 0.227580 0.275377 0.298998 0.266244 0.229983 0.200555 0.291321 0.283588 0.279530 0.262632 0.378547 0.376750
chargesum: 0.00000
title: Mulliken charges with hydrogens summed into heavy atoms:
elementType: S O O O O N N C C C C C C C
charge: 0.180344 -0.046474 -0.216678 -0.029279 -0.230700 0.009234 -0.032374 -0.224352 0.114790 -0.060932 0.066509 0.049081 0.239622 0.181210
polarizability: 1.51263948e+02 -7.53226057e+00 1.21158232e+02 -5.40842117e+00 4.86989168e-01 9.61748428e+01
1716.lowfreq: -4.2825 -0.0024 -0.0019 -0.0013 1.1775 11.3360 26.7513 30.0613 39.4981
frequency: 26.5002 30.0128 39.4490 45.8380 58.4749 91.2063 93.4810 101.4590 157.6597 159.4712 208.7625 221.4626 235.7363 261.9541 284.5812 292.4957 311.8260 337.1968 397.7570 451.5902 476.0609 555.3110 576.6177 596.1969 612.2316 612.6939 655.1983 664.7598 710.0420 725.8551 757.9029 763.6317 772.3612 843.0875 922.3948 938.0339 997.5015 1007.0794 1040.5512 1044.1073 1074.3585 1106.7622 1114.4821 1126.6542 1129.8236 1185.1502 1199.8225 1220.5635 1240.0194 1258.9275 1276.3182 1293.9790 1303.8361 1325.1496 1331.1854 1372.0274 1392.1953 1450.5530 1452.7386 1485.4117 1641.1362 1644.5299 1655.8429 1660.2536 2874.2088 3001.2790 3014.1127 3029.1405 3039.1617 3066.3895 3078.7923 3115.0725 3449.7726 3470.0420 3496.9758 3512.3526 3578.9485 3599.1782
redmass: 5.7932 8.2142 9.8679 7.1839 5.1116 5.8299 5.4691 1.9014 4.1738 3.5003 2.5899 1.7317 1.9186 2.3314 2.7985 2.3498 2.9683 3.6628 8.5576 4.4343 3.3826 3.6556 1.3745 2.9923 1.4792 1.2656 3.0577 1.5980 3.7810 4.7190 3.5761 1.7043 3.5210 2.2162 1.9644 1.5472 3.3049 2.3041 2.1442 1.8386 3.7848 1.4294 3.0132 2.1054 1.2321 1.3369 1.4280 1.3173 1.4462 1.4853 1.3393 1.5366 1.1801 1.5500 1.3854 1.4071 1.4327 1.0776 1.0872 1.0867 1.0957 1.1199 7.5997 8.2337 1.0716 1.0677 1.0768 1.0560 1.0869 1.0866 1.1024 1.1092 1.0451 1.0451 1.0639 1.0641 1.0976 1.0981
irintensity: 0.6147 0.8339 0.2474 1.4799 0.7006 0.8565 1.4198 3.7905 0.6256 1.0841 11.4950 26.5399 23.4307 24.6322 15.0952 20.8458 4.8015 31.4529 8.3526 16.3175 7.9618 83.3741 203.8299 12.5462 110.2786 175.2731 19.4495 292.3972 5.0941 55.6615 3.1374 10.6560 4.6749 13.2454 9.3055 5.9803 41.7918 193.9674 278.7957 33.5236 10.8139 22.7292 34.1831 5.1576 0.5328 2.6898 7.5007 10.9519 1.8835 3.8294 11.8121 9.1773 8.2617 9.2910 7.9693 3.2495 9.4823 8.3096 11.1297 4.0874 40.6017 77.1276 29.3941 318.0241 110.7904 8.5289 19.2401 9.8334 18.4204 7.7201 24.3593 6.8069 2.2605 0.6551 15.3374 24.1738 6.2739 1.6225
temp: 298.150 k
press: 1.00000 atm
elementType: 16 8 8 8 8 7 7 6 6 6 6 6 6 6 1 1 1 1 1 1 1 1 1 1 1 1 1 1
symmnumber: 1
zpe: 576275.1 jmol-1
zpe.correction: 0.219492 hartree
zpe.thermalcorrener: 0.236773 hartree
zpe.thermalcorrenthalpy: 0.237717 hartree
zpe.thermalcorrgfe: 0.171809 hartree
zpe.sumelectzpe: -1082.470418 hartree
zpe.sumelectthermal: -1082.453136 hartree
zpe.sumelectthermalent: -1082.452192 hartree
zpe.sumelectthermalfe: -1082.518100 hartree
dipole: 1.3614 0.2626 -0.6009
dipole: 1.5111
quadrupole: -72.9511 -84.4602 -96.4678
quadrupole: 6.0625 10.7759 -5.8873
quadrupole: 11.6752 0.1662 -11.8415 6.0625 10.7759 -5.8873
hfenergy: -1082.6899094 hartree
pointgroup: C01 [X(C7H14N2O4S1)]
dipole: -0.5300996 0.1280982 0.2366915 debye
polarizability: 151.6542422|6.331841|120.6459089|-6.0091811|-1.0509194|96.2968722 unknown
InChI: InChI=1S/C7H14N2O4S/c8-2-1-5(7(12)13)14-3-4(9)6(10)11/h4-5,10,12H,1-3,8-9H2
charge 0 multiplicity 1
28 atoms
S  -0.002803 -0.590563 0.498773
O  -2.796919 2.346445 -0.208092
O  -0.929788 1.710901 -1.427398
O  2.885284 -2.21189 -0.114505
O  3.492525 -0.512367 -1.581694
N  3.755753 1.154628 0.838711
N  -4.391973 -1.921973 -0.026056
C  -1.501275 0.543221 0.715553
C  -2.768728 -0.326569 0.924904
C  1.368798 0.722708 0.512179
C  2.760279 0.077517 0.717086
C  -3.146581 -1.186456 -0.301358
C  -1.663402 1.539706 -0.432178
C  3.081935 -0.870676 -0.455837
H  -1.330707 1.136459 1.634446
H  -2.615175 -0.989445 1.794642
H  -3.606006 0.355764 1.166536
H  1.191023 1.407498 1.357578
H  1.321464 1.272736 -0.441751
H  2.748558 -0.514383 1.647499
H  -2.344277 -1.921592 -0.493668
H  -3.197298 -0.528183 -1.203658
H  3.937684 1.632242 -0.051884
H  4.622089 0.872616 1.307722
H  -4.561598 -2.729795 -0.63004
H  -5.221505 -1.330241 0.078246
H  -2.866943 3.012189 -0.945346
H  3.055988 -2.790999 -0.90751
