program: Gaussian 09
title: 000145928
version: EM64L-G09RevD.01
frameworkgroup: C1[X(C11H7BrN2)]
method: RPBEPBE
basis: SDD
operation: Freq
keyword: #p
keyword: freq=noraman
keyword: PBEPBE/SDD
title: #p freq=noraman PBEPBE/SDD
converged: NO NO NO NO
title: Mulliken charges:
elementType: Br N N C C C C C C C C C C C H H H H H H H
charge: 0.014137 -0.484641 0.006742 0.192261 0.251522 0.247800 0.190540 -0.379017 -0.309594 -0.322700 -0.444232 -0.210200 -0.194712 -0.353748 0.315911 0.245793 0.260012 0.235988 0.247246 0.249553 0.241337
chargesum: 0.00000
title: Mulliken charges with hydrogens summed into heavy atoms:
elementType: Br N N C C C C C C C C C C C
charge: 0.014137 -0.168730 0.006742 0.192261 0.251522 0.247800 0.190540 -0.133224 -0.049582 -0.086712 -0.196985 0.039354 -0.194712 -0.112411
polarizability: 2.73613775e+02 3.33405988e-01 1.38934540e+02 5.12882461e-03 -8.10967614e-04 5.40754446e+01
1716.lowfreq: 0.0004 0.0005 0.0006 2.9837 4.1463 10.9210 58.9494 133.2943 141.0822
frequency: 58.9356 133.2939 141.0807 181.8504 212.8180 293.1090 297.0037 328.3802 429.7436 445.2517 466.5308 515.1173 517.7932 568.0017 594.0861 601.7379 627.5049 690.3823 738.1195 742.3445 774.6928 819.1617 835.8477 848.0695 862.2651 876.6282 895.1684 954.3557 955.0058 992.4894 1019.9259 1050.3730 1129.0104 1169.5769 1211.4483 1228.0200 1242.8388 1270.3261 1309.6546 1329.7825 1346.0998 1384.2773 1423.8011 1443.5742 1460.4225 1470.2030 1561.0699 1573.2940 1595.3872 1629.4602 3122.6705 3137.4008 3148.0186 3159.0206 3162.1964 3174.2325 3612.1818
redmass: 9.3037 8.1924 4.3979 5.7182 12.3568 6.1067 4.4424 5.2494 3.0351 3.1472 7.7992 4.3042 1.1208 7.3096 5.1479 4.6250 7.9703 7.5438 3.6165 5.6717 2.8558 1.5240 1.5290 5.8267 1.4960 5.8557 1.4366 1.4132 1.3534 4.4208 2.6129 2.0601 1.7154 1.9001 2.0388 1.3504 3.0646 1.7111 2.6652 2.7036 1.7426 5.0780 2.9844 2.1574 4.0031 3.8030 7.1226 7.7258 6.5478 8.2045 1.0915 1.0883 1.0891 1.0931 1.0978 1.0964 1.0804
irintensity: 0.3129 0.5004 0.0483 0.0009 1.2784 2.3220 3.9447 0.3129 21.6351 1.1006 10.1411 5.7850 109.2284 0.0424 7.6324 0.4009 0.9597 6.8792 8.9195 15.3079 9.4603 80.1227 12.9130 3.0587 28.2405 65.2489 3.3881 0.0238 0.1744 0.8647 11.5329 33.6629 3.6640 0.6707 9.5436 22.7594 46.5329 9.7069 31.4376 12.5291 18.1333 21.0911 62.5132 68.7014 30.6387 6.4480 17.6616 3.3868 34.1196 107.2199 22.4269 8.1561 1.9904 2.4954 23.8851 5.5944 62.3808
temp: 298.150 k
press: 1.00000 atm
elementType: 35 7 7 6 6 6 6 6 6 6 6 6 6 6 1 1 1 1 1 1 1
symmnumber: 1
zpe: 399319.7 jmol-1
zpe.correction: 0.152093 hartree
zpe.thermalcorrener: 0.162459 hartree
zpe.thermalcorrenthalpy: 0.163403 hartree
zpe.thermalcorrgfe: 0.114883 hartree
zpe.sumelectzpe: -545.404764 hartree
zpe.sumelectthermal: -545.394398 hartree
zpe.sumelectthermalent: -545.393454 hartree
zpe.sumelectthermalfe: -545.441974 hartree
dipole: -1.0074 -0.6085 0.0001
dipole: 1.1769
quadrupole: -112.6887 -71.1829 -95.1986
quadrupole: 2.7440 -0.0001 -0.0006
quadrupole: -19.6653 21.8405 -2.1752 2.7440 -0.0001 -0.0006
hfenergy: -545.5568569 hartree
pointgroup: C01 [X(C11H7Br1N2)]
dipole: -0.3854459 -0.2566 0.0000383 debye
dipolederiv: -0.837429 -0.1004559 -0.0000349 -0.1732204 -0.0886058 0.0001235 0.0001231 -0.0000382 -0.0343416 -1.082915 -0.0039218 -0.0000218 0.0385407 -0.4867577 -0.0000104 0.000102 -0.0000594 -0.3138288 -0.5818287 0.059083 -0.0000046 -0.0945739 -0.1503644 -0.0000216 0.0000173 -0.0000169 -0.2488446 -0.0864 -0.2044385 0.0000055 0.3550084 -0.1501389 0.0000046 -0.0000597 -0.0000029 -0.0141272 0.437121 0.1984047 0.0000117 -0.3456147 -0.044526 0.0000015 -0.0000123 0.000021 -0.00938 0.5961731 -0.3564786 0.000003 -0.6277834 0.2965096 -0.0000103 0.0000083 0.0000155 0.0790113 0.2620793 0.4458753 -0.0000113 0.8388692 0.0877347 0.000019 -0.0000455 0.0000104 0.1128759 0.3504761 0.0973753 0.0000553 -0.2415444 0.0852198 0.0000034 0.0000999 -0.0000147 -0.1301068 -0.5156517 0.1985228 0.0000171 -0.0013055 -0.0542121 -0.0000635 -0.0000176 0.0000135 -0.1494093 -0.1136776 -0.1580015 -0.0000023 0.104082 0.0548731 -0.0000177 0.0001265 -0.0000315 -0.1075732 0.2889219 -0.3032619 0.0000049 -0.0824301 0.2525946 0.0000371 -0.0000118 0.000022 -0.119103 -0.6311308 -0.2337861 -0.0000507 -0.2236896 -0.1316347 -0.0000502 -0.0002355 0.0000467 -0.1284826 1.3729153 0.1568718 0.0000428 0.4033987 0.3040831 -0.0000642 -0.0000503 -0.0000009 -0.1271747 0.1517047 0.2449212 0.0000178 0.1287679 0.0827061 0.0000375 -0.0000559 0.0000315 -0.1161673 0.1242328 -0.0000952 -0.0000053 -0.0161467 0.2250803 0.0000157 -0.0000433 0.0000244 0.3480266 0.0450808 -0.0766555 -0.0000106 -0.033967 -0.0508336 -0.000004 -0.0000563 0.0000088 0.1549467 0.0787801 -0.0193536 0.000009 -0.0491684 -0.0341506 0.0000347 0.000013 0.0000061 0.1818953 0.0916891 0.0713213 0.000002 0.0072108 -0.0812582 -0.0000058 0.0000009 -0.0000025 0.1527802 0.0778099 0.018011 0.0000085 0.0468518 -0.112347 -0.0000274 0.0000325 -0.0000152 0.1483008 0.0092222 0.0796375 -0.0000212 0.0754979 0.0193208 0.0000028 0.0000742 -0.0000093 0.1698652 -0.0371735 -0.1135753 -0.0000151 -0.1087835 -0.023293 -0.0000048 -0.0000095 -0.0000086 0.1508371 unknown
polarizability: 273.3244688|6.2442724|139.2238459|0.0051595|-0.0005848|54.0754446 unknown
InChI: InChI=1S/C11H7BrN2/c12-7-1-2-8-9-3-4-13-6-11(9)14-10(8)5-7/h1-6,14H
charge 0 multiplicity 1
21 atoms
Br -4.997678 -0.42442 -0.000147
N  0.315567 -1.647371 0.000021
N  3.842848 -0.332038 0.000029
C  -0.330853 0.569015 0.000003
C  1.125422 0.513913 -0.000015
C  -0.797686 -0.792842 0.0000
C  1.491028 -0.87722 0.000033
C  -1.276001 1.621592 -0.000093
C  -2.171288 -1.117939 -0.000048
C  2.165451 1.47211 0.000007
C  2.849529 -1.263904 0.000014
C  -2.652711 1.317596 -0.000159
C  -3.075264 -0.038994 -0.00014
C  3.496123 0.997075 0.000028
H  0.278906 -2.664094 0.00007
H  -0.953471 2.667706 -0.000114
H  -2.522251 -2.154044 -0.000017
H  1.960538 2.547268 0.000008
H  3.164329 -2.3139 -0.000014
H  -3.39509 2.120627 -0.000229
H  4.337452 1.698563 0.000063
