program: Gaussian 09
title: 000145949
version: EM64L-G09RevD.01
frameworkgroup: C1[X(C16H13NO4)]
method: RPBEPBE
basis: SDD
operation: Freq
keyword: #p
keyword: freq=noraman
keyword: PBEPBE/SDD
title: #p freq=noraman PBEPBE/SDD
converged: YES YES NO NO
title: Mulliken charges:
elementType: O O O O N C C C C C C C C C C C C C C C C H H H H H H H H H H H H H
charge: -0.238400 -0.238400 -0.417383 -0.226398 -0.219947 0.144964 -0.351602 0.169553 0.169021 -0.375083 0.049115 0.049123 0.446867 -0.364516 -0.364492 -0.484146 -0.434215 -0.434211 -0.232473 -0.232301 0.172546 0.243852 0.242782 0.249393 0.250522 0.279843 0.279816 0.258909 0.258837 0.246944 0.246902 0.239009 0.238963 0.376607
chargesum: 0.00000
title: Mulliken charges with hydrogens summed into heavy atoms:
elementType: O O O O N C C C C C C C C C C C C C C C C
charge: -0.238400 -0.238400 -0.040776 -0.226398 -0.219947 0.144964 0.135032 0.169553 0.169021 0.124832 0.049115 0.049123 0.446867 -0.084673 -0.084676 0.033600 -0.187271 -0.187309 0.006536 0.006662 0.172546
polarizability: 2.60990929e+02 9.20248827e-02 2.20290191e+02 -3.36321935e+01 -1.57279488e-01 1.09803675e+02
1716.lowfreq: -13.9208 -5.4886 0.0006 0.0006 0.0010 6.7333 19.0968 21.0428 30.0316
frequency: 19.0424 20.5199 29.9771 71.8567 80.4877 85.9672 93.9566 154.6402 167.5638 190.6949 236.4243 242.7213 272.4617 357.9314 364.2916 365.1777 401.9568 423.9260 426.2779 429.2078 468.1504 501.5370 502.2467 540.5769 542.2369 561.7323 587.7724 616.0843 637.4680 640.4517 675.9863 719.6703 736.8399 742.1957 784.3506 793.4466 798.1909 820.1531 853.9042 860.7084 882.9503 898.0472 947.8215 966.8092 1002.2412 1007.3139 1009.7530 1022.3893 1023.3472 1047.6612 1065.6390 1077.2149 1091.5254 1115.6354 1147.2274 1178.4652 1186.0567 1220.7447 1227.4586 1240.3885 1240.9855 1255.4639 1289.4557 1292.4087 1325.0934 1345.7604 1367.6428 1380.5438 1389.7423 1410.8523 1429.4787 1435.3295 1439.7491 1445.8987 1458.0420 1475.6691 1516.1756 1564.0242 1579.5464 1588.8144 1611.8835 1634.5328 1670.9825 2989.7098 3019.4239 3035.8282 3037.4317 3079.4081 3107.0173 3131.6599 3133.4259 3152.5687 3153.0840 3169.7821 3170.3972 3514.7140
redmass: 11.5539 6.8788 7.6895 5.4157 2.5460 2.3294 7.6672 7.3592 4.6434 5.4991 3.9418 6.5741 4.2846 5.9220 7.5041 3.4341 8.0500 5.9912 4.6880 6.4769 3.3022 3.8218 2.0104 6.0256 7.1795 5.8782 4.8678 3.5766 1.3382 6.2898 5.5247 3.1682 5.3322 1.2253 2.4116 5.3465 1.5170 2.1433 5.5055 2.2038 2.4906 6.0788 1.3489 1.4494 1.3728 1.4003 4.4554 3.3653 3.7608 2.3576 2.8104 1.8626 2.8507 1.8089 1.5188 1.3059 1.2940 1.7696 2.7519 1.4444 1.8014 2.8187 1.1732 1.5059 2.5441 1.3666 1.6096 2.0182 2.3086 6.3501 1.9697 1.6231 1.7168 1.4572 2.6489 1.0889 5.0094 10.3774 6.2704 7.2613 8.6746 7.8450 8.2807 1.0606 1.0598 1.0578 1.0987 1.1035 1.1066 1.0885 1.0879 1.0918 1.0916 1.0984 1.0983 1.0640
irintensity: 1.2953 0.1234 2.4715 0.0178 0.8764 0.0140 1.9864 4.3598 1.2551 2.5339 0.0011 5.9706 0.2362 0.9856 20.2160 11.3622 3.0423 67.3944 0.0039 0.0998 0.3474 6.7929 24.5744 9.8130 0.0365 18.5500 5.2991 0.0003 123.2585 3.0447 0.2169 0.1317 0.7607 11.9569 85.4293 0.6910 0.0018 7.8049 0.8103 54.4535 6.9691 4.4597 0.0007 0.0563 0.0052 2.7075 0.3574 267.9906 0.8479 65.1525 18.2243 8.8401 65.1563 0.4479 15.9144 0.3528 3.2801 3.1482 15.4168 3.8291 19.7742 112.7468 5.9347 48.3255 253.8868 37.3422 6.4856 18.9918 10.4945 0.2612 0.9595 64.5017 31.8716 29.8206 5.7373 14.6293 2.9710 280.6796 87.4010 106.2359 39.6979 23.1455 197.2597 12.5652 2.0651 30.7309 3.1707 6.4593 5.8072 0.5452 4.9304 6.8963 12.1147 14.8742 17.3610 20.9988
temp: 298.150 k
press: 1.00000 atm
elementType: 8 8 8 8 7 6 6 6 6 6 6 6 6 6 6 6 6 6 6 6 6 1 1 1 1 1 1 1 1 1 1 1 1 1
symmnumber: 1
zpe: 676009.7 jmol-1
zpe.correction: 0.257479 hartree
zpe.thermalcorrener: 0.275048 hartree
zpe.thermalcorrenthalpy: 0.275992 hartree
zpe.thermalcorrgfe: 0.209114 hartree
zpe.sumelectzpe: -971.744416 hartree
zpe.sumelectthermal: -971.726846 hartree
zpe.sumelectthermalent: -971.725902 hartree
zpe.sumelectthermalfe: -971.792780 hartree
dipole: -4.0833 0.0377 -0.0379
dipole: 4.0836
quadrupole: -88.2413 -121.3766 -127.5564
quadrupole: -0.1307 -7.9580 0.0648
quadrupole: 24.1501 -8.9851 -15.1650 -0.1307 -7.9580 0.0648
hfenergy: -972.0018941 hartree
pointgroup: C01[X(C16H13N1O4)]
dipole: -1.606192 0.0337752 -0.0150599 debye
polarizability: 260.9403449|-1.6507308|220.1610445|-33.6986615|-3.8371496|109.9834052 unknown
InChI: InChI=1S/C16H13NO4/c18-13(19)8-3-9-17-15(20)11-6-1-4-10-5-2-7-12(14(10)11)16(17)21/h1-2,4-7,18H,3,8-9H2
charge 0 multiplicity 1
34 atoms
O  0.648268 2.269585 -0.899734
O  0.554728 -2.395478 -0.69544
O  6.721963 -0.058841 0.236392
O  5.125029 0.021236 1.919614
N  0.575509 -0.062765 -0.809491
C  -2.15191 0.027922 0.015688
C  2.004719 -0.107428 -1.219522
C  -1.448731 1.248454 -0.239686
C  -1.499798 -1.23751 -0.13491
C  2.95005 -0.053305 0.000134
C  -0.023843 1.220727 -0.66593
C  -0.074703 -1.304227 -0.55655
C  -3.533596 0.074175 0.431015
C  -2.098526 2.482786 -0.085376
C  -2.200328 -2.426834 0.119361
C  4.419096 -0.087742 -0.457564
C  -4.167947 1.350901 0.577984
C  -4.220451 -1.158622 0.681124
C  -3.461739 2.532894 0.324144
C  -3.564357 -2.385866 0.527193
C  5.395534 -0.035469 0.700966
H  2.152916 -1.04638 -1.778498
H  2.181174 0.758972 -1.878691
H  2.7458 -0.908661 0.667913
H  2.760703 0.869154 0.576686
H  -1.53206 3.397878 -0.286457
H  -1.67262 -3.37831 -0.002938
H  4.64986 0.760863 -1.131249
H  4.63725 -1.003855 -1.041089
H  -5.217093 1.389207 0.893737
H  -5.270052 -1.127697 0.996285
H  -3.954926 3.503169 0.440242
H  -4.097631 -3.321908 0.721163
H  7.340413 -0.023826 1.016084
