program: Gaussian 09
title: 000145935
version: EM64L-G09RevD.01
frameworkgroup: C1[X(C21H25NO2)]
method: RPBEPBE
basis: SDD
operation: Freq
keyword: #p
keyword: freq=noraman
keyword: PBEPBE/SDD
title: #p freq=noraman PBEPBE/SDD
converged: YES YES NO NO
title: Mulliken charges:
elementType: O O N C C C C C C C C C C C C C C C C C C C C C H H H H H H H H H H H H H H H H H H H H H H H H H
charge: -0.484292 -0.431424 -0.185000 -0.199639 -0.186409 0.009061 0.322245 -0.658487 0.264709 -0.373763 -0.323918 0.429476 0.116954 -0.655500 -0.644139 -0.352071 0.488133 -0.700752 -0.477881 -0.038218 -0.701592 -0.833266 0.114686 -0.351026 0.228194 0.210361 0.237642 0.236118 0.192138 0.186826 0.206626 0.184015 0.249615 0.261596 0.210020 0.224474 0.223975 0.211736 0.220341 0.238611 0.204369 0.206455 0.217364 0.238774 0.223123 0.225965 0.250806 0.380318 0.382650
chargesum: 0.00000
title: Mulliken charges with hydrogens summed into heavy atoms:
elementType: O O N C C C C C C C C C C C C C C C C C C C C C
charge: -0.103974 -0.048774 -0.185000 0.028555 0.023952 0.009061 0.322245 -0.184727 0.264709 0.005201 0.066724 0.429476 0.116954 -0.405885 -0.382543 0.082423 0.488133 -0.044699 -0.239270 -0.038218 -0.073403 -0.145405 0.114686 -0.100220
polarizability: 3.18259351e+02 -1.35518036e+01 2.74569250e+02 1.37332548e+01 -1.14202399e+01 1.50920266e+02
1716.lowfreq: -51.1335 -6.7083 -1.9837 -0.0004 0.0004 0.0007 3.9256 26.7073 39.3105
frequency: -51.1261 26.5129 39.1731 51.5291 69.6013 71.7847 76.5897 97.3557 133.7115 157.2446 165.9773 185.6397 204.6872 216.5117 235.3575 244.8479 253.4354 269.3004 287.1461 292.3781 296.8752 307.9399 333.3648 351.8887 355.1314 392.6351 398.0708 432.5278 466.2499 482.5371 488.0562 502.5814 520.9983 546.2124 556.0548 581.0926 598.2139 607.3111 611.3046 630.0837 690.0707 724.4615 733.7673 745.3894 752.5901 764.5550 784.5264 793.0410 809.6926 822.3038 863.7800 874.2745 881.9484 908.2314 922.6658 936.6325 948.6403 961.1138 969.1067 985.0706 1007.4701 1009.8819 1039.5582 1046.0865 1061.5410 1066.9156 1089.3296 1108.1269 1111.2679 1125.7499 1134.2103 1150.2818 1152.7005 1163.1734 1176.4500 1182.9166 1200.6322 1214.1745 1224.1345 1228.8851 1246.3978 1257.5917 1260.0509 1275.3898 1284.4894 1297.2045 1312.8557 1316.1935 1329.6465 1332.0536 1346.3800 1365.0697 1373.0650 1382.9892 1384.8363 1387.2518 1398.7733 1406.3379 1422.2586 1435.4668 1456.5712 1460.6008 1471.2364 1472.8454 1474.6927 1475.3879 1476.2190 1476.8207 1485.0569 1488.2777 1491.2785 1497.3377 1600.6690 1611.7613 1619.6099 1624.9242 2827.2421 2832.4684 2842.3931 2960.6050 2966.7571 2974.1103 2974.5873 2984.6861 2985.1792 3005.1803 3013.5293 3036.8413 3055.7531 3061.1438 3066.3268 3067.9993 3079.7495 3083.8029 3090.3243 3108.5312 3121.4998 3134.8438 3173.0097 3514.8892 3550.5476
redmass: 1.0107 3.6078 2.7839 3.6230 2.4517 3.4967 3.2921 2.6325 3.8267 4.5766 3.0564 3.7373 3.3672 1.5460 2.2340 1.9827 2.7633 2.1269 2.4616 2.8916 4.9242 3.1514 3.4350 3.5387 4.6008 2.0222 1.6043 4.1974 4.4626 3.3547 3.9518 1.2628 4.0824 3.4868 3.6525 4.7127 4.1043 3.5233 4.3856 4.7276 4.5674 5.0605 2.4301 2.3819 2.4047 3.5429 3.0266 1.4806 1.6096 1.7539 1.6047 1.4736 1.9474 1.4562 2.2869 1.5250 2.8096 2.8115 2.2813 2.3924 2.1565 1.8867 2.6072 1.6858 2.6110 2.1349 2.2619 2.0733 1.8222 1.5236 2.3082 1.8680 1.2766 2.3537 1.4460 1.9133 1.8064 2.1047 1.3413 1.5479 1.7378 1.5816 1.9721 1.2352 1.3070 1.4067 1.5937 1.4497 1.9527 1.5151 2.7670 1.6170 1.5092 3.6669 1.2294 1.2900 1.2293 3.9606 3.5491 4.4212 1.1365 1.0876 1.0731 1.1670 1.1581 1.0954 1.0459 1.0492 2.4401 1.0879 1.0928 3.4676 6.3730 7.3051 8.4333 7.5092 1.0781 1.0760 1.0774 1.0582 1.0376 1.0640 1.0397 1.0358 1.0618 1.0974 1.0868 1.1005 1.0952 1.0964 1.1009 1.0996 1.0985 1.0997 1.1007 1.0906 1.0919 1.0893 1.0953 1.0646 1.0661
irintensity: 0.5190 0.1250 0.0175 0.0466 0.0297 0.4739 0.2889 0.6695 0.9414 0.1769 0.4847 0.3774 3.5942 1.1632 0.9717 0.2810 2.9816 1.3915 3.3103 3.1103 6.7948 3.7161 0.7552 5.3570 1.4348 69.5423 79.8311 2.8539 8.4725 13.6715 13.3725 105.4578 5.4043 2.2005 6.4953 6.8202 8.2589 3.6864 27.1350 5.2536 2.1292 12.6105 2.4940 4.8782 8.4566 1.5446 16.8820 0.0788 7.2844 34.0847 0.3144 19.9449 5.1720 1.5609 3.9388 0.6936 1.0317 4.2523 2.7549 18.4339 13.3566 15.6948 16.5313 10.8121 10.6423 6.9282 17.2264 10.8658 3.2152 20.2633 18.6018 14.6915 13.6164 62.6641 103.0465 21.9567 136.2181 146.6602 4.2291 19.4327 23.7746 4.2691 24.4856 2.3750 22.9771 7.2461 4.7416 5.8247 32.0899 9.6307 8.4451 1.7298 1.3038 0.0860 13.2972 22.5885 11.1025 13.9580 2.2015 108.5683 31.1122 4.2526 1.3494 16.1086 12.1950 14.1713 6.5121 6.0990 7.7740 10.1476 17.3027 37.1858 17.9342 22.3842 5.7045 33.2575 21.3110 60.3238 165.0816 33.4532 68.2942 22.1903 37.2702 26.9878 29.3725 21.9167 28.1194 1.9831 21.1546 33.7858 69.4625 51.9985 56.8523 15.2093 36.5026 10.2601 13.4016 12.1069 9.3425 70.4473 52.5404
temp: 298.150 k
press: 1.00000 atm
elementType: 8 8 7 6 6 6 6 6 6 6 6 6 6 6 6 6 6 6 6 6 6 6 6 6 1 1 1 1 1 1 1 1 1 1 1 1 1 1 1 1 1 1 1 1 1 1 1 1 1
symmnumber: 1
zpe: 1073127.2 jmol-1
zpe.correction: 0.408733 hartree
zpe.thermalcorrener: 0.430942 hartree
zpe.thermalcorrenthalpy: 0.431886 hartree
zpe.thermalcorrgfe: 0.357902 hartree
zpe.sumelectzpe: -1018.681546 hartree
zpe.sumelectthermal: -1018.659336 hartree
zpe.sumelectthermalent: -1018.658392 hartree
zpe.sumelectthermalfe: -1018.732376 hartree
dipole: -3.1164 1.3213 -1.5802
dipole: 3.7356
quadrupole: -154.9257 -127.7540 -145.3472
quadrupole: 4.9195 0.0804 -1.3545
quadrupole: -12.2500 14.9216 -2.6716 4.9195 0.0804 -1.3545
hfenergy: -1019.0902782 hartree
pointgroup: C01 [X(C21H25N1O2)]
dipole: -1.2750152 -0.4589624 0.5689669 debye
polarizability: 320.426758|11.6286081|273.423766|-7.6761437|-9.1622426|149.8983425 unknown
InChI: InChI=1S/C21H25NO2/c1-4-6-16-14-9-12(3)10-15-19-13(7-8-18(23)21(19)24)11-17(20(14)15)22(16)5-2/h7-10,16-17,23-24H,4-6,11H2,1-3H3
charge 0 multiplicity 1
49 atoms
O  3.639046 -1.764748 0.615585
O  5.674073 -0.127683 0.004237
N  -2.074129 1.47048 0.502997
C  -0.593201 1.275166 0.597207
C  -2.782247 0.173199 0.833808
C  -0.454948 -0.225311 0.527084
C  -1.689702 -0.871754 0.647567
C  0.278435 1.858975 -0.546705
C  0.744112 -0.900945 0.22166
C  -4.052948 -0.046655 -0.028564
C  -2.625029 2.630882 1.237233
C  1.70939 1.324588 -0.422859
C  1.930206 -0.039459 -0.023077
C  -1.752923 -2.277367 0.555101
C  0.66514 -2.318351 0.092631
C  -3.795397 -0.094547 -1.549754
C  -0.5664 -3.008831 0.274296
C  -2.128407 3.989888 0.712709
C  2.819949 2.147315 -0.707367
C  3.263456 -0.484735 0.134565
C  -5.101645 -0.2062 -2.364556
C  -0.622157 -4.518028 0.095599
C  4.37041 0.35235 -0.162051
C  4.147769 1.669746 -0.59797
H  -0.195059 1.661581 1.570973
H  -3.104874 0.176737 1.907613
H  0.288051 2.962226 -0.533216
H  -0.179905 1.544891 -1.506706
H  -4.772947 0.76844 0.191989
H  -4.542475 -0.986273 0.304912
H  -3.726369 2.592394 1.135726
H  -2.401877 2.557917 2.334488
H  -2.705533 -2.81078 0.659314
H  1.530104 -2.899167 -0.253683
H  -3.13262 -0.949679 -1.787372
H  -3.242116 0.820293 -1.834572
H  -2.317154 4.076734 -0.371905
H  -2.654893 4.812813 1.230545
H  -1.046573 4.124667 0.889468
H  2.650005 3.183535 -1.020384
H  -5.663262 -1.124132 -2.10381
H  -5.766119 0.657534 -2.170491
H  -4.896768 -0.235219 -3.450723
H  -0.763327 -4.788592 -0.969026
H  0.309171 -5.005064 0.435034
H  -1.461576 -4.960172 0.660169
H  5.008637 2.30727 -0.818219
H  2.880777 -2.211165 1.069986
H  5.621548 -1.05786 0.35121
