program: Gaussian 09
title: 000145930
version: EM64L-G09RevD.01
frameworkgroup: C1[X(C15H13N3)]
method: RPBEPBE
basis: SDD
operation: Freq
keyword: #pfreq=noraman
keyword: PBEPBE/SDD
title: #p freq=noraman PBEPBE/SDD
converged: YES YES NO NO
title: Mulliken charges:
elementType: N N N C C C C C C C C C C C C C C C H H H H H H H H H H H H H
charge: -0.456702 -0.176694 -0.013586 -0.522584 0.191468 0.094455 -0.459566 -0.083277 0.244576 -0.472742 0.182137 0.217522 -0.307098 -0.394274 -0.373069 -0.399041 -0.256819 -0.209011 0.242669 0.262031 0.226409 0.230563 0.228167 0.232359 0.370759 0.234880 0.236942 0.241901 0.237527 0.225351 0.224745
chargesum: 0.00000
title: Mulliken charges with hydrogens summed into heavy atoms:
elementType: N N N C C C C C C C C C C C C C C C
charge: -0.085943 -0.176694 -0.013586 -0.017883 0.191468 0.094455 -0.002594 -0.083277 0.244576 -0.012216 0.182137 0.217522 -0.072218 -0.157332 -0.131168 -0.161514 -0.031468 0.015734
polarizability: 2.87638162e+02 8.27194893e+00 2.15703853e+02 -1.21729788e+00 5.67254875e-01 8.21388326e+01
1716.lowfreq: -9.3169 -6.3727 -0.0002 0.0004 0.0006 5.3938 52.6889 86.0306 95.7080
frequency: 52.6775 86.0082 95.6974 101.3542 122.8211 161.4295 225.3078 253.1085 283.6831 295.0581 327.8424 361.3293 435.1279 463.9311 476.6323 554.9586 565.6477 567.2527 585.6443 620.6329 632.4531 665.5615 685.8864 755.0208 759.8092 777.5451 790.8876 804.2457 817.6778 828.7636 843.7000 864.0117 864.3763 870.6304 880.8553 916.2851 943.1269 949.6739 961.6632 978.5975 994.7889 1015.3465 1032.8571 1046.5225 1053.1917 1107.9599 1137.5229 1143.6111 1166.3694 1190.2073 1193.5904 1218.8472 1222.3159 1249.4521 1265.6398 1289.4456 1296.0672 1319.5115 1326.6151 1337.4674 1375.6733 1405.9187 1426.1796 1439.7023 1451.0096 1459.9944 1461.5035 1478.0610 1484.2651 1559.8224 1570.2729 1583.8722 1594.7149 1637.1429 2985.5821 3006.7918 3019.1065 3048.8361 3076.7680 3093.0203 3128.7396 3133.7779 3137.6051 3151.5718 3159.6833 3166.6150 3382.6774
redmass: 3.6597 3.3109 4.7540 2.1572 3.8788 3.3851 4.8562 4.0114 5.1099 5.6921 4.3453 6.7932 3.1013 3.2830 5.7244 6.2272 3.5932 4.9634 3.6392 5.8669 4.1137 2.6458 6.0297 1.4837 2.8851 5.3321 2.2320 2.2156 1.5419 3.7328 1.4104 1.9059 3.2033 3.7376 1.8130 2.5671 1.3971 1.4009 4.2845 1.3130 4.4811 2.1025 3.2780 1.7492 2.0820 1.9262 1.6639 1.3620 1.1184 1.3473 1.1971 1.7075 2.1247 1.8359 1.5559 1.4948 1.4195 2.0346 2.3689 3.6702 5.0179 3.2638 2.5754 3.4265 1.2125 1.3654 2.0636 1.1222 3.5088 6.1733 7.6409 7.3707 7.0136 8.1160 1.0639 1.0654 1.0666 1.0967 1.0970 1.1030 1.0851 1.0877 1.0896 1.0953 1.0972 1.1003 1.0834
irintensity: 1.8464 0.0120 3.4310 0.9363 0.0715 4.6306 2.6237 0.1048 2.5650 2.4359 0.9521 0.3021 9.8289 0.0290 3.1451 9.7115 2.7113 4.4376 0.1369 12.3443 4.5740 5.2847 0.9812 77.4681 23.3245 4.8779 7.0043 2.2166 111.9750 0.9467 16.9072 2.4715 1.7456 0.1340 1.4827 1.1434 3.0510 0.0390 35.7866 0.1283 1.8573 5.7137 1.9602 0.5929 0.4791 2.9449 61.7546 12.6584 1.1615 11.0627 1.8905 2.3675 10.6813 47.6008 52.2465 10.2852 16.4999 16.2625 27.9727 143.1880 13.6712 0.5558 15.1179 49.7794 18.4200 9.1370 37.1769 2.8968 79.2096 58.9518 0.7231 2.8618 33.9527 38.2822 44.9628 15.0569 37.2099 33.2706 7.1496 40.0425 0.1833 12.1735 3.4021 22.3100 33.0421 34.3197 227.6781
temp: 298.150 k
press: 1.00000 atm
elementType: 7 7 7 6 6 6 6 6 6 6 6 6 6 6 6 6 6 6 1 1 1 1 1 1 1 1 1 1 1 1 1
symmnumber: 1
zpe: 647497.6 jmol-1
zpe.correction: 0.246619 hartree
zpe.thermalcorrener: 0.260035 hartree
zpe.thermalcorrenthalpy: 0.260979 hartree
zpe.thermalcorrgfe: 0.206201 hartree
zpe.sumelectzpe: -742.437210 hartree
zpe.sumelectthermal: -742.423793 hartree
zpe.sumelectthermalent: -742.422849 hartree
zpe.sumelectthermalfe: -742.477627 hartree
dipole: 0.2225 -1.3615 -0.0738
dipole: 1.3815
quadrupole: -88.5431 -95.1581 -108.8248
quadrupole: -6.9906 -0.4876 0.2280
quadrupole: 8.9656 2.3506 -11.3161 -6.9906 -0.4876 0.2280
hfenergy: -742.6838285 hartree
pointgroup: C01 [X(C15H13N3)]
dipole: 0.0796515 0.5368971 0.0286026 debye
polarizability: 287.878408|-7.1781422|215.4702516|-0.1969153|0.6622235|82.1321875 unknown
InChI: InChI=1S/C15H13N3/c1-2-5-12-10(4-1)11-7-9-17-15(14(11)18-12)13-6-3-8-16-13/h1-2,4-5,7,9,18H,3,6,8H2
charge 0 multiplicity 1
31 atoms
N  -0.39474 0.995282 0.008734
N  2.337156 1.478742 0.014383
N  1.681771 -2.119475 -0.004001
C  4.004519 -0.259733 0.023624
C  2.543122 0.170894 0.003447
C  0.076325 -0.31032 0.001914
C  4.746158 1.084091 -0.238629
C  1.417434 -0.773397 0.000855
C  -1.033213 -1.224589 -0.003443
C  3.661458 2.173079 0.051095
C  -2.237724 -0.401588 -0.000051
C  -1.798077 0.973411 0.007696
C  -0.737061 -2.605554 -0.00882
C  -3.622533 -0.691704 -0.002618
C  -2.716429 2.044684 0.012878
C  0.627338 -2.992106 -0.008083
C  -4.543149 0.376601 0.002508
C  -4.091667 1.727574 0.010187
H  4.243651 -0.699474 1.010715
H  4.208517 -1.043694 -0.7236
H  5.641747 1.207221 0.392717
H  5.067682 1.140833 -1.293598
H  3.78281 2.630411 1.053395
H  3.665405 2.997668 -0.683819
H  0.282806 1.773664 0.015033
H  -1.521712 -3.368758 -0.013419
H  -3.976881 -1.728437 -0.008506
H  -2.377892 3.085842 0.018734
H  0.89795 -4.053584 -0.011362
H  -5.6186 0.169825 0.000579
H  -4.828269 2.538892 0.014057
