program: Gaussian 09
title: 000145965
version: EM64L-G09RevD.01
frameworkgroup: C1[X(C18H23N2S)]
method: RPBEPBE
basis: SDD
operation: Freq
keyword: #p
keyword: freq=noraman
keyword: PBEPBE/SDD
title: #p freq=noraman PBEPBE/SDD
converged: YES YES NO NO
title: Mulliken charges:
elementType: S N N C C C C C C C C C C C C C C C C C C H H H H H H H H H H H H H H H H H H H H H H H
charge: 0.221611 -0.053673 -0.184844 -0.408202 -0.383646 -0.380110 -0.396859 -0.434502 -0.071972 -0.386353 0.352875 0.195972 0.384114 -0.287347 -0.297850 -0.670154 -0.329201 -0.367745 -0.818694 -0.221958 -0.240314 0.250011 0.207351 0.235317 0.219564 0.211992 0.234282 0.231561 0.247107 0.252628 0.245343 0.245290 0.255217 0.268473 0.266959 0.267518 0.266506 0.267475 0.256565 0.278531 0.285909 0.270109 0.255176 0.259968
chargesum: 1.00000
title: Mulliken charges with hydrogens summed into heavy atoms:
elementType: S N N C C C C C C C C C C C C C C C C C C
charge: 0.221611 -0.053673 -0.184844 0.049159 0.071235 0.066164 0.081809 0.063469 -0.071972 -0.141063 0.352875 0.195972 0.384114 -0.032130 -0.029377 0.130828 -0.061726 -0.111180 0.015855 0.033218 0.019654
polarizability: 4.50453807e+02 6.05463478e+00 2.22382811e+02 9.09803438e+00 1.37090920e+01 1.39598516e+02
1716.lowfreq: -28.7869 -5.3971 0.0017 0.0022 0.0023 2.9941 25.1457 33.0446 44.8468
frequency: 24.5046 30.6315 43.9517 61.8166 69.9699 87.3193 108.7057 127.5375 154.7660 175.9942 181.0310 213.9994 222.3311 251.7005 267.9334 278.7416 317.6067 337.0516 357.9963 381.0899 407.9151 415.9197 429.5881 460.4340 464.5652 487.2970 503.3044 516.2609 534.5725 549.8660 563.6142 590.6235 629.0028 644.1721 686.1146 693.6695 748.1135 762.6006 768.8462 787.7446 800.0990 806.5353 844.6944 849.0008 851.7370 858.6213 880.9377 897.8494 929.2292 948.2662 963.4658 968.3566 987.1187 992.1488 997.6690 1005.4726 1031.6263 1038.9821 1065.1655 1078.4009 1099.3414 1115.3740 1121.0629 1133.4464 1153.2374 1156.7722 1183.8898 1192.5820 1194.3768 1217.1374 1247.4117 1251.5162 1256.1750 1277.0435 1290.2183 1295.1383 1311.3688 1327.6317 1337.0404 1339.7555 1347.6165 1349.5042 1359.0971 1390.1991 1409.6077 1413.0990 1431.5424 1437.5652 1441.5387 1456.5446 1457.2638 1464.6473 1465.2826 1466.2243 1470.4696 1473.8387 1481.5205 1487.4479 1512.3858 1558.4628 1573.1765 1612.2693 1621.3061 2979.5733 2983.9289 2988.9907 2991.1462 2996.4032 3008.2002 3022.2686 3056.7333 3058.3302 3067.4825 3082.9618 3093.7615 3102.4420 3119.5865 3131.5105 3144.7709 3146.9880 3150.3864 3154.0917 3157.1119 3177.3221 3181.6728 3188.1327
redmass: 4.0324 4.2690 3.2226 1.3275 3.5375 4.3409 2.9636 2.9223 3.4392 4.4632 2.9750 3.5384 2.9746 3.0959 1.2317 3.0200 2.7823 3.6196 3.4001 3.1985 2.9758 2.2314 3.1515 3.3258 3.8436 5.1624 3.3143 3.4891 3.3282 4.6390 4.0987 2.8473 5.4145 4.5185 3.8963 4.9156 4.5479 1.7510 2.0944 1.5957 1.6000 2.9347 1.5534 1.5461 3.7735 2.5412 1.5228 2.7300 3.2440 1.3391 1.3511 1.1871 1.2679 1.3670 2.3864 1.3610 2.1948 2.3182 3.5941 1.8794 2.5319 1.3466 2.1702 1.5774 1.2370 1.6064 1.3960 1.6207 1.4286 1.8707 1.5610 1.6977 1.3765 1.1909 1.9430 1.6794 2.4704 1.2152 1.3315 1.3691 1.2812 1.3341 1.3132 2.1404 3.2964 3.0318 2.3824 1.3798 1.0792 1.0777 1.0891 1.1084 1.1010 1.2698 1.1137 1.1748 1.1052 1.5035 3.1624 5.7415 5.9345 6.5360 6.5028 1.0677 1.0674 1.0663 1.0609 1.0606 1.0342 1.0286 1.0964 1.1000 1.1021 1.0979 1.0993 1.1024 1.0866 1.1006 1.1042 1.0890 1.1054 1.0899 1.0903 1.0954 1.0976 1.0984
irintensity: 0.1078 0.3437 0.4673 1.8977 0.2098 0.6481 3.8358 0.5157 0.6559 1.2497 1.7776 9.1024 0.5543 3.8974 4.1743 1.2458 0.8779 3.0050 5.8104 1.7119 5.3078 3.8661 1.9360 2.4565 3.9104 2.0262 13.6696 2.0494 36.9733 5.2112 1.9444 12.8694 16.3913 8.8006 8.6544 9.5934 3.5684 38.9553 36.4389 57.1649 3.2398 4.1609 48.4572 57.4417 2.5612 5.1631 18.5561 5.9229 24.1403 13.1104 2.0173 3.0174 9.5266 1.3360 86.6777 0.0496 6.8391 3.2494 2.6543 13.7773 0.5235 0.1840 18.7903 15.0767 12.3552 1.0840 71.7321 40.8323 21.1852 40.1642 44.5879 17.8507 2.4947 5.8979 45.9013 7.3288 54.6622 4.7673 2.0737 10.8462 3.5188 13.6592 13.2986 24.9384 6.5988 3.1575 20.2569 12.7903 12.8565 19.7751 11.5420 35.1818 11.8989 12.8570 23.2084 4.3689 6.0260 21.1114 42.7193 1339.7339 186.5533 141.7848 16.6256 19.1592 23.9029 31.6875 32.4580 24.9618 13.4027 13.3930 43.5544 23.3388 45.5391 13.0977 8.1749 7.5897 2.7411 2.7337 3.1946 1.5477 9.6032 1.0622 2.9125 7.8402 1.6633 5.2635
temp: 298.150 k
press: 1.00000 atm
elementType: 16 7 7 6 6 6 6 6 6 6 6 6 6 6 6 6 6 6 6 6 6 1 1 1 1 1 1 1 1 1 1 1 1 1 1 1 1 1 1 1 1 1 1 1
symmnumber: 1
zpe: 976746.1 jmol-1
zpe.correction: 0.372023 hartree
zpe.thermalcorrener: 0.392059 hartree
zpe.thermalcorrenthalpy: 0.393003 hartree
zpe.thermalcorrgfe: 0.322538 hartree
zpe.sumelectzpe: -1205.515812 hartree
zpe.sumelectthermal: -1205.495776 hartree
zpe.sumelectthermalent: -1205.494832 hartree
zpe.sumelectthermalfe: -1205.565298 hartree
dipole: 0.3827 0.5566 1.8221
dipole: 1.9433
quadrupole: -52.4440 -103.2418 -129.0659
quadrupole: 1.8720 3.1134 6.8227
quadrupole: 42.4732 -8.3246 -34.1486 1.8720 3.1134 6.8227
hfenergy: -1205.8878354 hartree
pointgroup: C01 [X(C18H23N2S1)]
dipole: -0.1446809 -0.5214389 0.5400837 debye
polarizability: 449.7905024|16.0819791|217.5176225|-0.6473595|25.0985774|145.1270093 unknown
InChI: InChI=1S/C18H23N2S/c1-19-16(11-10-15-8-4-5-9-17(15)19)14-18(21-2)20-12-6-3-7-13-20/h4-5,8-11,14H,3,6-7,12-13H2,1-2H3
charge 1 multiplicity 1
44 atoms
S  -1.122484 -1.189396 -1.784847
N  -3.076541 -0.521013 0.074806
N  1.436853 -0.41699 0.379927
C  -5.647013 0.863678 0.452922
C  -5.111219 0.499108 -0.950081
C  -4.480396 1.046177 1.452393
C  -4.176771 -0.737485 -0.909079
C  -3.574361 -0.205881 1.447651
C  -1.756709 -0.367365 -0.264299
C  -0.899328 0.513311 0.427138
C  0.534419 0.644757 0.408052
C  2.829443 -0.211982 0.198923
C  3.353827 1.12847 0.213659
C  1.078638 1.978658 0.483762
C  2.436969 2.219402 0.396978
C  0.983841 -1.803499 0.644608
C  3.71953 -1.306425 0.016213
C  4.756261 1.335485 0.056498
C  -1.792183 -2.956736 -1.61617
C  5.095441 -1.070814 -0.139378
C  5.623176 0.25029 -0.115346
H  -6.254656 1.784354 0.400225
H  -6.318706 0.05915 0.815213
H  -5.946082 0.277562 -1.640405
H  -4.553967 1.355198 -1.377505
H  -3.887952 1.942768 1.183112
H  -4.863909 1.204199 2.477123
H  -4.748856 -1.636255 -0.604707
H  -3.739457 -0.908633 -1.905077
H  -2.711107 -0.098061 2.123737
H  -4.164311 -1.082275 1.784392
H  -1.401793 1.344887 0.936156
H  0.367143 2.804017 0.565968
H  2.822936 3.243161 0.438767
H  -0.028854 -1.771265 1.069792
H  0.962985 -2.401495 -0.281526
H  1.6628 -2.268508 1.377557
H  3.352167 -2.333521 -0.031268
H  5.141837 2.360665 0.071335
H  -1.247209 -3.542821 -2.371927
H  -2.869615 -2.994118 -1.826344
H  -1.580698 -3.346775 -0.609464
H  5.769127 -1.920456 -0.289207
H  6.697986 0.41217 -0.236776
