program: Gaussian 09
title: 000145917
version: EM64L-G09RevD.01
frameworkgroup: C1[X(C10H11NO4)]
method: RPBEPBE
basis: SDD
operation: Freq
keyword: #p
keyword: freq=noraman
keyword: PBEPBE/SDD
title: #p freq=noraman PBEPBE/SDD
converged: YES YES NO NO
title: Mulliken charges:
elementType: O O O O N C C C C C C C C C C H H H H H H H H H H H
charge: -0.292789 -0.327889 -0.257638 -0.242254 -0.597812 0.121634 0.289553 -0.320678 -0.355861 0.217169 -0.235639 -0.200300 -0.218816 -0.675188 0.281608 0.275563 0.255605 0.233585 0.234706 0.232543 0.227333 0.212141 0.227673 0.232200 0.343575 0.339979
chargesum: 0.00000
title: Mulliken charges with hydrogens summed into heavy atoms:
elementType: O O O O N C C C C C C C C C C
charge: -0.292789 -0.327889 -0.257638 -0.242254 0.085742 0.121634 0.289553 -0.045115 -0.100256 0.217169 -0.002054 0.034406 0.241060 -0.003175 0.281608
polarizability: 1.52081205e+02 -6.55513494e+00 1.60205833e+02 6.61252271e+00 9.10444011e+00 7.64605903e+01
1716.lowfreq: -10.5034 -1.2169 -0.0005 0.0002 0.0004 3.5951 26.2960 57.9757 71.7528
frequency: 25.9983 57.9474 71.7524 83.5356 89.0358 105.0022 121.2592 160.7305 242.6427 246.2940 271.2351 285.8558 330.7203 378.7092 413.9456 439.0923 482.1456 498.7473 513.6257 522.4628 550.2786 630.9667 651.8131 676.4514 685.9474 725.1435 774.5812 783.1565 797.7201 800.1350 842.4562 886.5479 901.4139 969.9813 996.4127 1017.4379 1038.1925 1044.3885 1069.8341 1112.0551 1121.3533 1137.2185 1171.4485 1192.8055 1231.3981 1249.6221 1267.6071 1296.5022 1358.3131 1384.7183 1400.2595 1431.6498 1464.1051 1472.6644 1474.3122 1487.2617 1575.1993 1594.9047 1605.7385 1622.4467 1733.2285 2995.3894 3009.5177 3067.8747 3092.0294 3107.0066 3138.4148 3156.6834 3173.5461 3185.3620 3559.7313 3714.8798
redmass: 5.3534 3.2526 4.0350 5.3100 3.0159 4.7516 4.5434 3.6262 5.0342 1.5014 3.4906 5.0998 5.3139 3.8724 6.4828 3.6306 4.2917 1.1003 2.8241 1.4509 4.5072 5.9624 6.7930 5.2818 6.8444 4.5850 4.3432 1.4639 4.7859 1.1458 4.1865 1.4945 6.6362 1.3771 1.3399 2.6861 2.4165 4.1818 2.0844 2.2300 1.8471 1.4678 1.0753 3.3369 3.5784 1.1321 1.4981 3.1245 1.4134 10.3596 1.2698 2.3012 1.0403 2.3840 1.1071 1.0753 6.1364 1.2202 7.9351 8.3589 9.5146 1.0358 1.0581 1.1065 1.0985 1.1026 1.0865 1.0919 1.0962 1.0970 1.0448 1.1053
irintensity: 2.2520 0.8702 11.8817 3.4662 4.5194 5.7737 3.3669 0.4487 1.4234 0.2075 1.5039 7.4504 12.2364 3.0549 3.6641 0.6380 22.8094 46.3946 77.3722 182.1016 9.6439 1.0299 18.5712 22.2060 60.3731 17.6571 3.9413 67.5900 8.5059 5.5110 33.4891 1.6554 111.1954 3.4407 0.0934 16.3479 55.1327 292.9782 14.1939 2.1997 61.7218 5.3708 15.0332 262.8740 311.6437 0.0430 62.2092 301.7959 3.1981 4.8713 21.4596 7.8785 12.2484 53.0818 3.2676 9.9892 17.9418 123.0657 78.4507 179.2164 356.9007 22.0529 19.2543 7.5127 30.6239 43.9342 3.4137 16.6485 8.9134 8.5466 82.1802 51.7437
temp: 298.150 k
press: 1.00000 atm
elementType: 8 8 8 8 7 6 6 6 6 6 6 6 6 6 6 1 1 1 1 1 1 1 1 1 1 1
symmnumber: 1
zpe: 518992.9 jmol-1
zpe.correction: 0.197674 hartree
zpe.thermalcorrener: 0.212364 hartree
zpe.thermalcorrenthalpy: 0.213308 hartree
zpe.thermalcorrgfe: 0.154686 hartree
zpe.sumelectzpe: -742.226306 hartree
zpe.sumelectthermal: -742.211616 hartree
zpe.sumelectthermalent: -742.210672 hartree
zpe.sumelectthermalfe: -742.269294 hartree
dipole: 0.7268 0.2765 -1.7602
dipole: 1.9243
quadrupole: -70.3127 -68.3078 -93.1964
quadrupole: 0.6026 3.8780 4.5439
quadrupole: 6.9596 8.9645 -15.9241 0.6026 3.8780 4.5439
hfenergy: -742.42398 hartree
pointgroup: C01[X(C10H11N1O4)]
dipole: 0.3139875 0.1323215 -0.6760904 debye
dipolederiv: -1.8709074 0.0956712 -0.1812527 -0.0850469 -0.4559947 -0.0626161 -0.2730989 -0.0371061 -0.3220111 -0.3478233 -0.0187 -0.0771902 -0.4082496 -1.9113325 0.2465853 -0.0409476 0.310356 -0.5318401 -0.7175647 0.0832904 0.0041094 -0.0967739 -0.9039217 -0.2022085 -0.0468438 -0.1523724 -0.362534 -0.3675693 -0.0195302 -0.1422233 -0.0918348 -0.6745531 -0.0557143 -0.0516704 0.1370661 -1.024913 -0.7657188 -0.2931343 -0.0432245 -0.2752902 -1.1829854 -0.3632516 -0.0100021 -0.3234136 -0.4616142 -0.5236836 0.1407098 -0.0027538 0.3126653 -0.3764081 -0.0294731 0.000791 -0.1250825 -0.0197144 0.4128796 0.0912357 -0.048106 0.3873108 1.2038754 0.0073677 0.1199684 0.2701458 0.0354309 0.0538831 0.0274266 0.0332774 -0.2087975 0.051642 0.0210998 -0.0217151 0.0434708 -0.0851511 0.0375211 0.1512362 0.0492591 -0.0025368 -0.4433825 0.0174499 0.0400048 0.0151424 -0.1322981 2.0613355 -0.2746711 0.1510378 0.0500676 1.1640759 0.3002745 0.2925526 0.2238774 0.3477565 -0.2849202 0.0413497 0.0209674 0.0982474 0.0779736 0.0629256 0.0116227 0.0590318 -0.1548719 0.1498056 -0.0080479 0.0179867 0.0020767 0.1497445 0.0361337 0.0343698 0.051444 -0.1158725 0.9870269 -0.134743 0.0440576 -0.285095 0.2990856 -0.0428125 0.0117776 -0.0326726 0.3386202 -0.1263792 -0.0529252 -0.0408122 -0.0284802 0.0260555 -0.0181261 -0.0341237 -0.0204061 0.0520269 0.4949461 0.0138497 0.2896515 0.49346 2.4216655 0.0965886 0.065853 -0.3615953 1.5681496 0.0138675 -0.0556403 -0.02449 -0.0621577 0.1066537 -0.0094056 -0.0297109 -0.0186895 0.1439549 -0.0446163 -0.0391981 -0.0268942 -0.0518865 0.088965 -0.0272961 -0.029932 -0.0168582 0.1566161 0.0733877 -0.0470718 -0.0187494 -0.0231819 -0.1023085 -0.050673 -0.0170761 -0.055616 0.1500378 -0.0160429 0.1119203 -0.0036239 0.1047795 -0.0126223 -0.0105069 -0.0101265 -0.0188465 0.1511695 -0.0582914 -0.0385182 0.0294823 0.0569108 -0.0603755 0.0868332 0.0144156 0.0908358 0.0024432 -0.0504692 0.0089849 -0.034595 0.0816784 0.0303308 -0.0493593 0.0289844 -0.0749471 -0.1069871 -0.1197507 0.1007385 -0.0039913 0.1269395 0.0080982 -0.012116 0.0011649 -0.0151785 0.1112086 0.1073646 -0.0129953 0.0016936 -0.0813649 -0.0497461 0.1030208 0.0160189 0.1154857 -0.0011679 0.107968 0.0068003 0.0439079 -0.0441481 0.0658562 -0.0772325 -0.0011292 -0.0739194 -0.1107069 0.4082849 0.0696359 0.0025123 0.0150527 0.2344488 0.0084405 -0.0101872 0.0525416 0.198087 0.3854667 0.0523262 -0.0400364 0.0156554 0.2451598 0.0240721 -0.0609601 -0.0426937 0.174181 unknown
polarizability: 151.7630754|-7.4313917|159.35784|9.6430798|10.7402962|77.6267127 unknown
InChI: InChI=1S/C10H11NO4/c1-2-14-9(12)7-5-3-4-6-8(7)15-10(11)13/h3-6H,2,11H2,1H3
charge 0 multiplicity 1
26 atoms
O  2.293081 0.210638 0.213699
O  -1.829532 -0.993326 -0.585113
O  0.945773 -1.527823 -0.537993
O  -1.289553 -1.8972 1.547561
N  -1.844821 -3.24398 -0.299617
C  -0.044236 0.659649 -0.018065
C  -1.408696 0.311371 -0.242557
C  0.256766 2.018486 0.276678
C  -2.422118 1.291034 -0.198979
C  1.055927 -0.33938 -0.143387
C  -0.752484 2.998028 0.326736
C  -2.097505 2.634269 0.07885
C  3.462405 -0.71265 0.120906
C  4.691072 0.093347 0.530168
C  -1.592326 -2.065161 0.35027
H  1.301229 2.284481 0.456667
H  -3.454406 0.976541 -0.378225
H  -0.494571 4.03748 0.553673
H  -2.890575 3.389032 0.111799
H  3.276754 -1.572948 0.789081
H  3.527597 -1.090929 -0.915461
H  5.590642 -0.547068 0.481444
H  4.841035 0.954085 -0.14393
H  4.5892 0.470511 1.562052
H  -1.97292 -3.24902 -1.308531
H  -1.721439 -4.114168 0.209773
