program: Gaussian 09
title: 000145966
version: EM64L-G09RevD.01
frameworkgroup: C1[X(C21H29ClO)]
method: RPBEPBE
basis: SDD
operation: Freq
keyword: #p
keyword: freq=noraman
keyword: PBEPBE/SDD
title: #p freq=noraman PBEPBE/SDD
converged: YES YES NO NO
title: Mulliken charges:
elementType: Cl O C C C C C C C C C C C C C C C C C C C C C H H H H H H H H H H H H H H H H H H H H H H H H H H H H H
charge: -0.035906 -0.220964 0.199967 -0.441091 -0.452365 0.264656 -0.506037 0.200972 -0.761859 -0.747368 -0.339284 -0.841452 -0.336637 0.398511 -0.831365 -0.353637 -0.215047 -0.327527 0.448081 -0.844742 -0.421039 0.227264 -0.704454 0.203117 0.200289 0.207712 0.208336 0.219417 0.219678 0.226305 0.205002 0.221531 0.228639 0.224198 0.212640 0.224714 0.223679 0.227467 0.259198 0.238591 0.238218 0.230612 0.233638 0.216620 0.236318 0.220804 0.227294 0.225923 0.310987 0.201388 0.274958 0.274053
chargesum: 0.00000
title: Mulliken charges with hydrogens summed into heavy atoms:
elementType: Cl O C C C C C C C C C C C C C C C C C C C C C
charge: -0.035906 -0.220964 0.199967 -0.037684 -0.036318 0.264656 -0.066942 0.200972 -0.109021 -0.081892 -0.114570 -0.131109 -0.098046 0.398511 -0.128897 -0.137017 0.021271 -0.106722 0.448081 -0.080539 -0.219651 0.227264 -0.155443
polarizability: 8.01312559e+02 -8.43873661e+00 2.35739074e+02 1.68342201e+01 1.26799781e+00 1.52713559e+02
1716.lowfreq: -9.0523 -0.0012 -0.0010 0.0006 2.0726 3.2940 15.9433 24.6986 28.0113
frequency: 15.8442 24.6075 27.9181 30.5625 49.9518 51.6247 62.5772 73.8230 98.8945 115.4215 121.5296 125.8473 134.8909 142.8822 151.4521 189.5091 194.8472 220.5322 223.9197 246.1428 253.6441 261.4681 264.8372 284.8013 292.6723 299.7920 308.4522 341.0287 342.1868 361.0308 367.9440 393.3944 410.7497 419.1062 461.6028 473.6132 493.1830 520.6904 531.7761 560.5217 565.0311 566.5155 597.6719 651.5551 689.1135 715.8496 732.4525 789.9399 825.2192 833.4544 844.1726 857.0755 864.7355 880.6342 888.8673 900.8723 908.6718 919.0273 920.0609 925.6813 939.0682 962.9343 976.5517 981.2468 988.9172 1004.3460 1009.5950 1026.3718 1034.6144 1036.6448 1044.3263 1045.7364 1082.6600 1097.5371 1122.9517 1134.9178 1140.5668 1171.9903 1193.0846 1196.9631 1201.8297 1211.0310 1218.2633 1249.1210 1262.7598 1265.1737 1274.6055 1288.9034 1300.5753 1318.4907 1334.1761 1340.6087 1342.8114 1356.5877 1373.6709 1383.7862 1386.2666 1391.5845 1394.3091 1401.3455 1406.2158 1414.8968 1445.6442 1455.4534 1456.9253 1463.8179 1466.1739 1469.6906 1470.8622 1472.7150 1474.3613 1474.7257 1485.2446 1488.6507 1496.6741 1541.9694 1558.4042 1584.0085 1604.5963 1614.7938 1622.0008 2936.7478 2956.4601 2964.9443 2969.8534 2973.9293 2978.3472 2980.5591 2981.2946 2995.8741 3024.0159 3024.5322 3026.9355 3047.3056 3052.4536 3053.1242 3062.7207 3067.2142 3072.3041 3075.9952 3076.5609 3077.7345 3083.9334 3089.8823 3098.4813 3104.9334 3109.1991 3117.7908 3125.2457 3127.1979
redmass: 5.5600 4.3335 4.8212 3.9802 3.4503 2.9109 4.7202 3.5441 3.5408 3.0490 1.0863 2.7230 3.1765 3.2055 1.2585 2.3438 2.2413 2.9342 1.4282 1.8488 1.1589 2.0550 2.0133 2.1870 4.6709 3.8347 2.6233 2.7801 2.6347 2.5987 2.0204 2.6893 3.9598 2.8723 3.4851 3.2749 2.8654 3.0833 2.5827 2.1304 3.0630 2.9674 3.5683 3.9264 4.7231 3.5494 4.6294 2.5831 1.3208 3.2137 1.5865 2.6702 2.1968 2.2288 1.6823 2.0950 1.7475 4.9374 1.9178 1.5129 1.9806 1.1410 1.2588 1.3146 1.6024 1.3315 1.5960 1.8425 1.7313 1.5084 1.5332 1.6296 1.6073 2.4250 1.5619 1.0914 2.9165 2.1752 2.4951 2.1055 2.4784 2.0892 1.3556 1.4210 1.5614 1.5154 1.4357 2.1265 1.4965 1.5933 1.7657 1.5829 1.6478 2.1495 1.1873 1.5457 1.2043 1.2045 1.2130 1.4970 1.6726 1.0938 1.1095 1.1895 1.0721 1.0545 1.0830 1.0783 1.0497 1.0697 1.1356 1.0730 1.0595 1.0601 1.0484 3.5386 4.7765 5.2949 5.5595 5.5145 5.1697 1.0629 1.0405 1.0585 1.0357 1.0372 1.0394 1.0812 1.0397 1.0753 1.0568 1.0948 1.0983 1.1031 1.0968 1.0962 1.0992 1.0988 1.0997 1.0996 1.0891 1.0883 1.0891 1.0965 1.1071 1.0895 1.0951 1.0863 1.0953 1.0900
irintensity: 0.1527 1.7622 0.8096 1.8350 0.7681 2.9209 4.0166 1.2486 0.7130 0.9022 1.4880 0.2169 0.6823 0.5543 1.2143 1.6173 0.2852 0.2879 1.2288 0.4424 0.1921 1.5001 0.7227 1.4434 10.5393 0.3895 0.4621 1.5602 3.3514 1.0203 1.6755 10.1883 8.6743 1.5266 6.3999 0.0570 1.8502 2.3044 0.8663 1.2710 1.5026 5.8472 1.9429 3.5169 18.9267 62.2290 86.6691 11.1639 6.6034 2.9839 0.9583 2.1907 12.2731 1.0740 2.4774 3.2534 8.5652 27.5602 14.2875 0.6867 1.2070 12.2778 68.2039 47.3572 15.7853 3.0120 30.1372 4.6127 6.5415 0.5371 0.8119 16.3184 4.1046 549.2836 4.0245 1.2225 1.1086 60.7387 13.2572 19.8354 37.5153 4.1848 65.5936 73.4942 2.4460 48.4762 7.4415 60.3992 1.1838 16.4096 8.2199 6.9732 0.2805 19.6969 20.1620 33.1803 36.8032 20.7286 6.4551 50.9263 116.9569 24.2921 51.0927 415.5569 2.0951 4.1426 24.2838 36.6217 18.3014 8.4442 51.0440 12.2684 13.1931 9.3188 18.6750 1523.8391 61.7757 2.9500 88.6173 21.3480 43.5433 40.7400 48.2633 39.7264 23.2655 46.1192 16.9178 19.3755 32.1798 59.8862 35.8314 32.5196 71.3031 66.7603 12.6144 19.9556 9.6692 125.9981 32.1332 37.2220 8.7951 1.6346 27.7327 21.2280 6.4585 5.6615 14.3920 26.6364 18.1769 19.2084
temp: 298.150 k
press: 1.00000 atm
elementType: 17 8 6 6 6 6 6 6 6 6 6 6 6 6 6 6 6 6 6 6 6 6 6 1 1 1 1 1 1 1 1 1 1 1 1 1 1 1 1 1 1 1 1 1 1 1 1 1 1 1 1 1
symmnumber: 1
zpe: 1154588.9 jmol-1
zpe.correction: 0.439760 hartree
zpe.thermalcorrener: 0.466364 hartree
zpe.thermalcorrenthalpy: 0.467308 hartree
zpe.thermalcorrgfe: 0.380255 hartree
zpe.sumelectzpe: -1351.113449 hartree
zpe.sumelectthermal: -1351.086845 hartree
zpe.sumelectthermalent: -1351.085901 hartree
zpe.sumelectthermalfe: -1351.172954 hartree
dipole: -9.8469 1.9320 -0.0449
dipole: 10.0347
quadrupole: -208.0318 -136.8091 -150.1160
quadrupole: 11.0885 1.4856 1.4234
quadrupole: -43.0462 28.1765 14.8697 11.0885 1.4856 1.4234
hfenergy: -1351.5532089 hartree
pointgroup: C01 [X(C21H29Cl1O1)]
dipole: -3.8954934 -0.6415662 -0.001914 debye
polarizability: 800.9751458|-7.2877466|234.9324163|-22.7303448|8.438825|153.8576297 unknown
InChI: InChI=1S/C21H29ClO/c1-16(8-6-9-17(2)14-19(23)15-22)11-12-20-18(3)10-7-13-21(20,4)5/h6,8-9,11-12,14H,7,10,13,15H2,1-5H3
charge 0 multiplicity 1
52 atoms
Cl 9.704522 -1.374903 -0.651094
O  7.667949 0.728486 0.067783
C  -5.385201 0.793247 -0.423728
C  -6.753131 0.047865 -0.403105
C  -6.640536 -1.412468 -0.870575
C  -4.237681 -0.104744 0.129155
C  -5.729234 -2.174861 0.105961
C  -4.431093 -1.444043 0.42527
C  -5.555084 2.075836 0.4470
C  -5.041776 1.22419 -1.881211
C  -2.951234 0.585906 0.319608
C  -3.419384 -2.325881 1.138325
C  -1.684221 0.062598 0.147527
C  -0.434245 0.78734 0.335078
C  -0.484135 2.23518 0.78937
C  0.760673 0.109277 0.087658
C  2.099457 0.620295 0.208156
C  3.230512 -0.13675 -0.062294
C  4.604413 0.329618 0.043635
C  4.871287 1.758307 0.482285
C  5.621732 -0.571539 -0.267529
C  7.077126 -0.35045 -0.239394
C  7.861832 -1.622024 -0.635138
H  -7.469664 0.612045 -1.031446
H  -7.15538 0.057335 0.631238
H  -6.217495 -1.455008 -1.892813
H  -7.638706 -1.887636 -0.914641
H  -5.475515 -3.178088 -0.295856
H  -6.274251 -2.36998 1.056172
H  -5.640833 1.822221 1.519728
H  -4.722518 2.791654 0.323046
H  -6.480029 2.603468 0.146338
H  -4.055512 1.721387 -1.926392
H  -5.004157 0.353953 -2.561193
H  -5.802134 1.931335 -2.26426
H  -3.016911 1.653274 0.569217
H  -2.868061 -2.976642 0.429099
H  -3.949302 -3.006027 1.833586
H  -2.6769 -1.748011 1.711767
H  -1.584051 -0.976645 -0.192118
H  -1.000164 2.324248 1.763768
H  0.516103 2.680508 0.897499
H  -1.048818 2.853912 0.065992
H  0.677117 -0.939502 -0.238224
H  2.235406 1.66016 0.530084
H  3.0878 -1.179481 -0.385085
H  4.401276 2.472158 -0.220887
H  4.430802 1.945282 1.48007
H  5.949892 1.960829 0.524348
H  5.310877 -1.583025 -0.573451
H  7.657467 -2.436275 0.080941
H  7.576416 -1.951529 -1.648566
