program: Gaussian 09
title: 000001615
version: EM64L-G09RevD.01
frameworkgroup: C1[X(C11H15NO2)]
method: RPBEPBE
basis: SDD
operation: Freq
keyword: #p
keyword: freq=noraman
keyword: PBEPBE/SDD
title: #p freq=noraman PBEPBE/SDD
converged: YES YES NO NO
title: Mulliken charges:
elementType: O O N C C C C C C C C C C C H H H H H H H H H H H H H H H
charge: -0.271121 -0.267306 -0.312487 -0.028778 -0.612881 0.553604 -0.707918 -0.537124 0.195288 -0.396423 0.160360 -0.337524 -0.639195 -0.201970 0.197674 0.233528 0.194969 0.218337 0.218909 0.232441 0.262037 0.253156 0.234456 0.247592 0.189601 0.218057 0.232433 0.235009 0.235278
chargesum: 0.00000
title: Mulliken charges with hydrogens summed into heavy atoms:
elementType: O O N C C C C C C C C C C C
charge: -0.271121 -0.267306 -0.059331 0.168896 -0.184384 0.553604 -0.038232 -0.275088 0.195288 -0.161967 0.160360 -0.089931 0.000896 0.268317
polarizability: 1.88540006e+02 -9.10992806e+00 1.19310530e+02 -1.13227268e+01 -5.47862965e+00 8.85950156e+01
1716.lowfreq: -54.7059 -16.9133 -6.6876 -3.0978 -0.0010 -0.0008 -0.0005 29.1012 45.9348
frequency: -54.6843 28.2312 45.9027 60.9333 104.4644 169.5897 200.6169 221.8224 224.5020 237.4464 288.4089 320.4354 330.5385 412.7389 421.3912 444.1645 460.0022 520.1415 590.8652 618.0218 660.4716 679.1216 718.6453 753.2285 776.8993 803.3013 832.3248 842.4700 878.7229 883.7420 907.5985 928.4366 932.2771 978.8762 1036.7281 1055.7344 1060.3412 1065.5519 1085.7106 1106.8508 1119.1204 1130.6827 1168.9425 1182.9434 1183.4801 1214.6147 1255.6168 1270.0199 1284.9072 1322.9214 1339.1574 1365.1031 1382.2718 1395.3570 1437.3465 1438.0792 1456.4019 1464.5751 1470.5261 1475.1775 1477.8650 1485.2722 1488.5240 1497.2205 1609.8499 1628.7334 2828.1787 2869.9858 2963.3190 2985.1105 3007.9491 3024.2641 3042.5838 3076.2596 3083.4376 3083.9568 3090.2388 3133.5830 3165.5947 3178.6000 3435.3930
redmass: 2.3362 3.4304 3.4013 4.5215 2.0900 5.1616 1.0433 4.5582 1.8319 3.7641 1.8274 5.7963 2.5760 3.0125 3.3240 2.1375 2.7216 5.5613 4.7422 3.8218 1.6475 9.0064 4.4156 4.8069 5.8830 1.5807 1.9520 9.5279 1.5790 1.5257 2.5960 1.4214 1.9312 5.3576 1.8473 2.1909 2.1649 1.4578 2.0687 1.2996 1.0362 1.3701 2.7177 1.6780 1.8739 1.5680 3.9951 1.3436 1.3522 1.4225 1.4258 1.2793 1.2256 4.0812 1.2822 3.2618 1.1654 1.0569 1.1372 1.1049 2.1955 1.0511 1.3082 1.0494 7.8084 8.3605 1.0810 1.0567 1.0642 1.0357 1.0533 1.0735 1.0967 1.1002 1.0993 1.1189 1.0994 1.0898 1.0930 1.0954 1.0743
irintensity: 14.5919 0.2779 0.4033 0.0891 2.9552 0.1381 0.4408 0.7048 0.4342 0.5393 2.1927 0.6036 1.6221 5.3721 1.9442 21.1886 10.6961 8.8826 7.5532 37.6420 53.2176 0.8642 0.9046 8.7311 12.0109 43.6875 4.7478 31.0166 22.0773 2.1908 2.6046 0.8811 2.9067 141.0624 6.0862 18.8093 15.9241 4.4240 0.8496 0.2468 0.0007 10.4155 68.4326 37.9637 4.2989 3.7046 186.7924 1.3207 18.3170 10.7180 22.5539 1.0865 22.2826 11.3414 2.8564 45.3297 22.1371 7.3977 3.9968 9.7337 124.9678 12.3688 28.4697 21.0027 6.7351 0.6932 85.4257 143.8311 46.7316 16.7264 131.8319 51.9006 20.2005 40.7709 34.0984 39.6565 30.0193 12.7455 3.9195 4.6281 2.7300
temp: 298.150 k
press: 1.00000 atm
elementType: 8 8 7 6 6 6 6 6 6 6 6 6 6 6 1 1 1 1 1 1 1 1 1 1 1 1 1 1 1
symmnumber: 1
zpe: 629238.2 jmol-1
zpe.correction: 0.239664 hartree
zpe.thermalcorrener: 0.252816 hartree
zpe.thermalcorrenthalpy: 0.253761 hartree
zpe.thermalcorrgfe: 0.198900 hartree
zpe.sumelectzpe: -632.264290 hartree
zpe.sumelectthermal: -632.251138 hartree
zpe.sumelectthermalent: -632.250194 hartree
zpe.sumelectthermalfe: -632.305054 hartree
dipole: -0.2692 0.9159 -0.3547
dipole: 1.0184
quadrupole: -74.1860 -83.3823 -85.3654
quadrupole: -8.0171 -0.0771 1.8445
quadrupole: 6.7919 -2.4044 -4.3875 -8.0171 -0.0771 1.8445
hfenergy: -632.5039543 hartree
pointgroup: C01 [X(C11H15N1O2)]
dipole: -0.0972492 0.3359705 -0.1954717 debye
polarizability: 188.5523832|-11.6122627|117.2362809|-8.052151|-9.9862957|90.6568872 unknown
InChI: InChI=1S/C11H15NO2/c1-8(12-2)5-9-3-4-10-11(6-9)14-7-13-10/h3-4,6,8,12H,5,7H2,1-2H3
charge 0 multiplicity 1
29 atoms
O  2.953957 -1.498343 0.510154
O  3.718992 0.479935 -0.623789
N  -4.151809 0.069383 0.315346
C  -2.769853 -0.031211 -0.217166
C  -1.789107 0.255521 0.959518
C  -0.331952 0.359965 0.535441
C  -2.522944 -1.420537 -0.838578
C  0.571044 -0.715021 0.791671
C  1.891339 -0.569774 0.36032
C  0.134844 1.521626 -0.13449
C  2.339941 0.588892 -0.304987
C  1.48181 1.658964 -0.568155
C  -5.238994 0.008908 -0.680278
C  4.139965 -0.85243 -0.113821
H  -2.581636 0.739141 -1.011321
H  -1.925225 -0.542382 1.712993
H  -2.101391 1.207523 1.438533
H  -3.17347 -1.593727 -1.714131
H  -2.731979 -2.207782 -0.091138
H  -1.47554 -1.512393 -1.174755
H  0.24031 -1.619954 1.309189
H  -4.247091 0.894281 0.923629
H  -0.563488 2.3465 -0.317128
H  1.83394 2.558814 -1.078874
H  -5.11798 0.723286 -1.532322
H  -6.20079 0.227814 -0.183006
H  -5.316149 -1.007257 -1.105657
H  4.48131 -1.471212 -0.962136
H  4.919247 -0.713031 0.655636
