program: Gaussian 09
title: 000145899
version: EM64L-G09RevD.01
frameworkgroup: C1[X(C10H10N2O3)]
method: RPBEPBE
basis: SDD
operation: Freq
keyword: #p
keyword: freq=noraman
keyword: PBEPBE/SDD
title: #p freq=noraman PBEPBE/SDD
converged: YES YES NO NO
title: Mulliken charges:
elementType: O O O N N C C C C C C C C C C H H H H H H H H H H
charge: -0.258812 -0.407138 -0.227717 -0.063111 -0.553304 -0.500011 -0.218679 0.212614 0.245156 0.027744 0.166762 -0.369670 -0.343332 -0.212483 -0.224319 0.254781 0.266677 0.278643 0.253374 0.255596 0.288717 0.285409 0.231250 0.230485 0.381368
chargesum: 0.00000
title: Mulliken charges with hydrogens summed into heavy atoms:
elementType: O O O N N C C C C C C C C C C
charge: -0.258812 -0.025770 -0.227717 -0.063111 0.020822 0.021447 0.059963 0.212614 0.245156 0.027744 0.166762 -0.116296 -0.087736 0.018767 0.006166
polarizability: 1.84117881e+02 1.62440665e+01 1.08297246e+02 2.09874734e+01 -1.63134899e+01 9.27717686e+01
1716.lowfreq: -3.2193 -0.0004 0.0006 0.0009 2.4115 4.1796 29.0551 34.5459 45.9720
frequency: 28.9777 34.5219 45.9626 71.3595 129.4047 202.7590 231.8060 249.4301 254.9101 271.9453 312.4894 357.5166 430.9555 442.9684 463.0665 528.7432 575.6247 593.8938 601.9958 610.6427 649.7396 668.5984 711.8487 724.4452 753.4485 761.0150 765.8297 805.6454 833.5385 862.9740 864.8756 943.1592 961.4592 980.6628 981.2548 1002.7601 1038.6698 1087.8953 1099.5048 1128.8746 1146.3729 1161.8878 1191.7613 1211.6603 1238.3239 1259.7277 1279.1809 1309.6930 1315.2989 1377.7196 1402.3322 1435.1730 1444.7413 1459.1395 1554.6894 1614.0542 1621.6271 1652.2682 1657.2661 3026.2021 3064.4880 3099.5209 3138.8868 3156.1952 3173.7660 3181.3784 3453.0683 3499.7242 3578.7171
redmass: 6.6828 6.7745 6.7736 4.7918 6.7608 1.3430 4.7458 3.9431 6.1837 2.7705 2.3809 4.3768 3.3145 4.4587 4.2613 6.0616 3.8193 2.1358 1.6922 7.0342 4.2451 1.6424 4.3158 4.2106 2.1020 3.0533 2.0901 5.7695 7.9746 1.4120 7.2795 1.3816 2.2781 3.0201 1.3309 2.0453 2.4936 2.7053 1.7115 2.7769 1.6516 1.3690 1.6555 2.0433 1.9102 2.1045 1.4722 1.4091 1.5065 1.4332 4.3009 3.1635 1.0976 2.6644 9.2039 7.9793 8.0379 1.2138 4.8220 1.0595 1.0868 1.1026 1.0863 1.0914 1.0958 1.0991 1.0456 1.0641 1.0968
irintensity: 0.0120 0.0788 0.5364 1.3797 2.4471 38.9502 0.3805 4.7871 0.8442 7.4149 34.6700 0.7062 15.7022 12.2072 0.6454 2.9139 0.6437 46.5444 101.6212 0.1913 25.0008 283.2612 18.5820 2.1601 48.0963 7.2623 55.4702 50.7398 14.4667 0.1031 1.8674 4.3437 4.9497 27.3929 1.0830 9.9824 168.7863 31.0643 36.7526 30.4412 15.4939 4.2955 8.4544 14.3970 23.3061 4.1214 3.1026 2.7794 7.9141 3.5505 6.3741 31.7315 14.5639 4.3943 62.1505 7.6407 4.8156 122.1008 170.7185 5.3679 4.5082 4.5371 3.3075 13.9897 11.6290 10.8376 3.3882 15.6662 7.0254
temp: 298.150 k
press: 1.00000 atm
elementType: 8 8 8 7 7 6 6 6 6 6 6 6 6 6 6 1 1 1 1 1 1 1 1 1 1
symmnumber: 1
zpe: 495074.8 jmol-1
zpe.correction: 0.188564 hartree
zpe.thermalcorrener: 0.201872 hartree
zpe.thermalcorrenthalpy: 0.202816 hartree
zpe.thermalcorrgfe: 0.146875 hartree
zpe.sumelectzpe: -721.150249 hartree
zpe.sumelectthermal: -721.136941 hartree
zpe.sumelectthermalent: -721.135997 hartree
zpe.sumelectthermalfe: -721.191939 hartree
dipole: 0.9131 -0.4979 2.0535
dipole: 2.3018
quadrupole: -75.8527 -86.7703 -85.7032
quadrupole: 5.9185 -1.0028 0.4670
quadrupole: 6.9227 -3.9949 -2.9278 5.9185 -1.0028 0.4670
hfenergy: -721.3388135 hartree
pointgroup: C01 [X(C10H10N2O3)]
dipole: -0.3682868 -0.1850931 -0.806367 debye
dipolederiv: -0.8619511 0.0134823 -0.2482665 0.1353093 -0.4284084 -0.1965452 -0.2046076 -0.2314627 -0.3508179 -0.8117978 0.1294943 -0.3305628 0.2073718 -0.3067766 0.2253061 -0.3182303 0.1693404 -0.7170208 -0.7320961 -0.1049059 -0.2191205 -0.4234093 -0.7103119 -0.0573815 -0.2405396 0.0413885 -0.4470632 -0.5692198 0.167855 0.0685052 0.1581265 -0.396563 -0.1111495 0.0156962 -0.0602885 -0.2957866 -0.6867473 0.1276936 0.0210202 0.2543778 -0.7002128 0.1910574 -0.0237218 0.2516185 -0.2913505 -0.118084 0.0952806 -0.0030139 0.0480412 -0.0107471 0.0418503 0.1562156 -0.0668882 0.0809305 0.6053697 -0.2500348 -0.0444605 -0.1956423 0.2135084 0.0240476 -0.1747146 0.0257881 0.1450167 0.7813439 -0.0515424 0.0976826 -0.0481891 0.5080296 0.369223 0.230782 0.3155022 0.348243 0.4426638 -0.079303 0.0920926 -0.3486565 0.1116616 -0.1098603 -0.1261525 -0.0147271 0.0260737 0.2893354 -0.0830868 0.0391294 0.0787917 -0.0147765 -0.0214999 0.1515311 -0.0780344 0.0417094 1.0227776 0.0905762 0.6146914 0.4644436 0.89144 -0.2023018 0.6938107 -0.2125815 0.6556281 -0.0439696 0.0175756 0.0523605 0.0158667 -0.0302907 0.1042057 0.0681382 0.1158456 -0.0545787 0.040239 -0.0154703 0.0537767 -0.0682796 0.0278932 0.1179094 0.0207519 0.1268898 -0.0255803 -0.0548732 -0.0152201 0.0588895 0.0653069 -0.0421557 0.1137814 0.0996911 0.0927008 -0.054249 -0.032373 -0.1019007 -0.0040389 -0.1829124 -0.0468758 0.0329149 -0.0815182 0.0582818 -0.151458 0.0215016 -0.0070588 -0.0402908 -0.0386267 0.0591828 -0.0861616 -0.0307641 -0.0389196 0.0058805 0.0128958 -0.0145226 0.0054061 0.0053534 -0.0383248 0.0505187 0.0012876 0.0529942 0.0829126 0.0689086 -0.0117968 -0.0533867 -0.0088325 0.0344115 -0.0418325 -0.0682532 -0.0381425 -0.0203326 0.1000673 0.0249138 -0.0148976 0.0047233 0.0335536 -0.1110084 -0.0338717 -0.1060909 0.0861481 0.1030468 -0.0009292 -0.0284663 0.0263933 0.0274277 -0.1019852 -0.0092959 -0.1092842 0.0763061 0.1641548 -0.0028869 -0.01892 -0.0940182 0.2238762 -0.1721713 -0.0015575 -0.1207805 0.2312105 0.065491 0.034589 0.042032 -0.1065922 0.3546319 0.0136857 0.0786616 -0.0535134 0.066188 -0.0553269 -0.0220872 -0.1061255 -0.0170186 0.1065462 -0.0530407 -0.1080165 -0.054905 0.0769384 -0.0601599 0.1104531 -0.0031404 0.1144961 0.0499284 -0.0426534 -0.0054668 -0.0426197 0.1298356 0.3088032 -0.0511679 -0.0308959 -0.0464239 0.0833523 0.0230912 -0.0898557 -0.0221117 0.3552162 unknown
polarizability: 183.2942765|-18.3582013|109.2948231|21.0541752|15.7817999|92.5977962 unknown
InChI: InChI=1S/C10H10N2O3/c11-6(10(13)14)5-9-12-7-3-1-2-4-8(7)15-9/h1-4,6,13H,5,11H2
charge 0 multiplicity 1
25 atoms
O  -0.37197 -1.289883 -0.182483
O  1.764678 1.168618 -1.454975
O  3.634327 1.605569 -0.140691
N  -0.300553 0.526434 1.260205
N  4.048047 -1.272437 0.05473
C  1.786962 -0.907384 0.992093
C  2.731357 -0.705903 -0.245445
C  0.375677 -0.491158 0.754884
C  -1.633265 -0.653823 -0.229297
C  -1.590687 0.458151 0.659336
C  2.792026 0.795264 -0.585779
C  -2.759945 -1.006608 -0.980819
C  -2.727287 1.276483 0.818995
C  -3.894307 -0.175836 -0.812747
C  -3.877782 0.94238 0.069068
H  2.176783 -0.337824 1.853022
H  1.839151 -1.983635 1.231504
H  2.286084 -1.238167 -1.102519
H  -2.76606 -1.866713 -1.655279
H  -2.710045 2.132653 1.499182
H  4.593765 -0.694442 0.704697
H  4.593158 -1.523022 -0.775487
H  -4.806751 -0.4005 -1.375274
H  -4.780134 1.555182 0.166873
H  1.778367 2.1545 -1.598494
