program: Gaussian 09
title: 000145975
version: EM64L-G09RevD.01
frameworkgroup: C1[X(C19H27N3O5S)]
method: RPBEPBE
basis: SDD
operation: Freq
keyword: #p
keyword: freq=noraman
keyword: PBEPBE/SDD
title: #p freq=noraman PBEPBE/SDD
converged: YES YES NO NO
title: Mulliken charges:
elementType: S O O O O O N N N C C C C C C C C C C C C C C C C C C C H H H H H H H H H H H H H H H H H H H H H H H H H H H
charge: 0.171147 -0.284640 -0.306740 -0.436900 -0.207266 -0.277491 -0.422487 -0.373981 -0.338015 0.199863 0.187405 -0.212795 -0.697261 -0.701575 -0.142637 0.174491 -0.334327 -0.607873 -0.714048 0.528162 0.163784 -0.363914 -0.408612 -0.072620 -0.238715 -0.250159 -0.216542 -0.841908 0.361071 0.287079 0.231802 0.199580 0.278562 0.235869 0.191694 0.279885 0.310005 0.327985 0.279113 0.215042 0.220513 0.251114 0.275616 0.255852 0.346708 0.231246 0.223779 0.175083 0.231960 0.233276 0.225776 0.394655 0.256352 0.259943 0.246094
chargesum: 0.00000
title: Mulliken charges with hydrogens summed into heavy atoms:
elementType: S O O O O O N N N C C C C C C C C C C C C C C C C C C C
charge: 0.171147 -0.284640 -0.306740 -0.042245 -0.207266 -0.277491 -0.061417 -0.045997 0.008693 0.199863 0.187405 0.074285 0.012683 0.005873 0.167368 0.174491 0.159828 -0.136245 -0.182580 0.528162 0.163784 -0.132668 -0.184833 0.102463 -0.006755 -0.016883 0.009234 -0.079519
polarizability: 2.86589489e+02 -2.00432392e+01 2.52530315e+02 -5.29396902e+00 -1.45784182e+01 2.14732295e+02
1716.lowfreq: -11.3354 -6.9033 -4.3110 0.0016 0.0018 0.0020 4.3764 7.9272 16.1062
frequency: -6.8232 2.6075 15.9949 23.4402 28.6300 34.9022 41.6759 47.4097 48.4196 50.0550 62.2985 79.4872 80.1382 110.0018 115.8303 119.9874 129.0456 135.7697 150.5461 172.2373 197.0009 206.2735 216.4143 221.6181 236.2162 252.5628 257.8801 269.5597 288.6754 303.4113 313.5415 325.4181 340.3998 350.5299 372.0603 401.1733 401.9643 442.0309 476.0016 488.5145 531.7775 536.2829 555.7988 572.7655 594.3569 599.7144 614.9234 617.6426 643.7670 649.6676 688.9720 691.0617 703.8490 705.5443 710.5874 733.7654 754.6426 757.0398 781.6678 789.7337 810.4289 814.8530 852.9454 862.5594 873.4223 879.2266 903.7338 923.5901 929.1102 930.8290 955.2289 963.1630 974.5240 976.1961 989.4686 990.8183 996.8652 998.3658 1013.0056 1018.4554 1026.9040 1069.7234 1074.0783 1080.8931 1085.1568 1097.0295 1159.9218 1164.7106 1169.4203 1173.6441 1183.8204 1189.8164 1204.1312 1205.2419 1217.7594 1219.8528 1238.2816 1256.7272 1262.6981 1277.9909 1284.0005 1297.0342 1311.9245 1319.9013 1328.4714 1336.9246 1339.4065 1352.4367 1360.4785 1378.8757 1384.5526 1401.8709 1436.5161 1441.5085 1446.7213 1449.0233 1453.6642 1462.5540 1463.8280 1468.8024 1471.4830 1479.6906 1483.8416 1486.8658 1493.3917 1515.4025 1593.0111 1594.3683 1607.4716 1614.6857 1629.2958 1673.7708 2937.6784 2986.6806 2988.9430 2992.3206 2995.7891 2998.7727 3001.7081 3009.0939 3047.8187 3063.4876 3066.9906 3083.9953 3089.8744 3091.9185 3107.9292 3110.8856 3112.4394 3114.4667 3119.7769 3124.3559 3133.0508 3146.9455 3164.1662 3394.7517 3444.6008 3525.4804 3561.3768
redmass: 5.1026 3.4056 4.6417 6.0495 5.2826 9.0918 7.8726 7.3584 5.1179 5.9679 4.3618 4.8644 2.7600 5.0561 2.4083 5.6709 3.0595 2.6595 2.6016 4.3527 2.0151 4.5394 3.8692 1.7072 2.5681 1.1903 2.3249 3.9502 3.6041 4.7353 4.3555 3.1315 2.4103 4.8934 4.0401 2.8157 3.3372 3.5984 3.8194 3.6942 4.8641 4.8452 3.3171 1.6978 3.4333 1.6438 2.6329 4.3713 4.3003 5.2965 4.2188 3.8769 1.9375 2.4565 1.2835 1.5278 1.3363 1.7338 4.7144 5.0940 4.4183 3.6994 1.2568 3.3562 2.0316 3.7724 3.7110 1.7415 1.6390 1.5417 1.2298 1.5841 1.5803 1.3923 2.2658 5.7707 1.6399 2.0233 1.2953 2.1303 2.1924 2.0844 2.4657 3.5342 2.0297 1.9982 1.1645 3.2984 1.8780 1.0730 1.4685 1.1381 1.5688 1.8017 2.4327 1.8840 2.2308 1.4285 1.3885 1.6364 1.1463 1.8786 1.3301 1.5464 1.6099 1.2697 1.1639 1.3588 1.2295 1.1805 7.3101 1.2189 1.0852 2.0886 1.0736 1.0527 1.9632 1.0595 1.2115 1.1717 1.1041 1.0591 2.1922 1.9639 1.1837 1.6017 7.4467 6.0712 6.4231 6.1675 5.6916 9.3810 1.0866 1.0773 1.0358 1.0358 1.0593 1.0304 1.0679 1.0598 1.0908 1.0964 1.0979 1.0994 1.0995 1.1043 1.1012 1.1006 1.1050 1.0877 1.0875 1.1025 1.0905 1.0957 1.1014 1.0772 1.0781 1.0644 1.0770
irintensity: 0.0915 1.0853 0.2318 0.1313 0.3372 2.8699 0.5284 3.6579 0.8756 0.4216 0.1378 1.2292 2.3239 3.7306 1.2944 5.4798 1.9846 1.6177 4.5196 31.8225 1.2237 5.5632 9.6617 1.4893 2.3690 0.4642 2.3357 3.6572 8.3084 8.7481 8.5872 29.8274 1.0173 4.7190 0.7277 0.0273 5.3177 2.6166 20.9880 4.9106 5.1756 41.4581 13.5081 9.7917 54.2500 200.4599 31.5044 11.7520 13.2535 1.5380 5.7465 27.1337 52.4316 6.8601 100.2399 41.4272 87.6639 29.4526 2.9251 1.0149 3.6728 8.3272 0.8766 7.6562 15.4540 7.7752 53.9957 61.7854 3.6407 0.2622 8.4026 0.3696 13.8424 0.0303 0.0593 0.2159 0.8145 0.2359 2.0806 4.2917 6.4355 1.3034 95.6433 6.7067 137.0413 18.1488 7.3840 13.9637 3.5112 0.3118 14.5831 6.4660 21.0912 20.6155 0.7325 59.3890 11.0928 5.9740 15.8988 19.1169 0.5762 47.2666 3.0829 4.8624 22.1083 3.3086 1.2950 6.7855 18.2620 18.5236 0.2828 24.8785 1.2739 6.2241 24.6110 6.0558 666.4808 5.4379 20.1146 52.2931 30.1816 5.3788 72.3020 267.0227 86.1526 68.8244 190.4390 8.0554 17.9363 4.8980 258.9712 259.4342 127.6436 5.8160 17.5325 25.8690 24.7988 29.2773 31.9481 26.0026 6.0451 10.4501 0.7916 13.4652 53.7106 13.2700 3.5496 8.9747 21.7323 7.2199 5.6030 13.5026 11.2831 30.8347 18.4158 166.4513 111.4070 41.1158 32.6634
temp: 298.150 k
press: 1.00000 atm
elementType: 16 8 8 8 8 8 7 7 7 6 6 6 6 6 6 6 6 6 6 6 6 6 6 6 6 6 6 6 1 1 1 1 1 1 1 1 1 1 1 1 1 1 1 1 1 1 1 1 1 1 1 1 1 1 1
symmnumber: 1
zpe: 1159390.4 jmol-1
zpe.correction: 0.441589 hartree
zpe.thermalcorrener: 0.471784 hartree
zpe.thermalcorrenthalpy: 0.472728 hartree
zpe.thermalcorrgfe: 0.373892 hartree
zpe.sumelectzpe: -1676.580728 hartree
zpe.sumelectthermal: -1676.550533 hartree
zpe.sumelectthermalent: -1676.549589 hartree
zpe.sumelectthermalfe: -1676.648424 hartree
dipole: 7.5523 -1.1422 4.4704
dipole: 8.8502
quadrupole: -201.2210 -166.2207 -183.2314
quadrupole: -5.7505 -2.3095 -10.0398
quadrupole: -17.6633 17.3370 0.3263 -5.7505 -2.3095 -10.0398
hfenergy: -1677.0223166 hartree
pointgroup: C01 [X(C19H27N3O5S1)]
dipole: 2.8279539 0.912635 -1.8148806 debye
polarizability: 277.712826|25.422483|259.7300796|6.5488602|-15.8773728|216.4091933 unknown
InChI: InChI=1S/C19H27N3O5S/c1-19(2,22-16(24)14(20-12-23)9-10-28-3)18(27)21-15(17(25)26)11-13-7-5-4-6-8-13/h4-8,12,14-15,20-22,25H,9-11H2,1-3H3
charge 0 multiplicity 1
55 atoms
S  -3.43001 -3.825228 -0.175764
O  0.73072 0.734675 1.309417
O  -3.132913 1.399391 -1.640921
O  3.929204 3.472711 -0.652952
O  5.083338 2.930337 1.294215
O  -6.299828 0.352278 1.942433
N  -1.474033 0.984529 -0.047709
N  2.142095 1.535173 -0.353046
N  -5.124513 0.690453 -0.04852
C  -0.301118 1.444364 -0.826905
C  0.902599 1.204911 0.138119
C  -3.798894 0.402975 0.51066
C  -0.433804 2.957234 -1.165239
C  -0.137317 0.594788 -2.119593
C  3.362527 1.380024 0.442189
C  -2.766645 0.981408 -0.489062
C  -3.576764 -1.122433 0.77619
C  4.275928 0.200324 -0.05817
C  -3.613859 -1.97156 -0.503763
C  3.57606 -1.147024 0.006388
C  4.202712 2.655144 0.456885
C  3.388932 -1.803394 1.250074
C  3.093287 -1.770322 -1.171519
C  -6.265619 0.667672 0.716157
C  2.734744 -3.052098 1.3148
C  2.436774 -3.021397 -1.111831
C  2.255047 -3.66534 0.133282
C  -1.622777 -3.872765 0.353885
H  -1.227939 0.652444 0.898064
H  -3.707483 0.917885 1.488222
H  -0.515419 3.558885 -0.243521
H  0.434863 3.319389 -1.744489
H  -1.342735 3.106299 -1.770644
H  0.036223 -0.467122 -1.872135
H  0.712484 0.954556 -2.727569
H  -1.05586 0.683211 -2.722159
H  3.047708 1.164354 1.478449
H  2.228337 1.978811 -1.268751
H  -4.366876 -1.452415 1.473409
H  -2.607488 -1.253675 1.295401
H  4.59653 0.420354 -1.09404
H  5.180954 0.204057 0.578046
H  -4.589601 -1.876417 -1.009958
H  -2.823111 -1.679044 -1.218207
H  -5.120326 1.032828 -1.01911
H  3.756842 -1.336461 2.172275
H  3.240028 -1.279254 -2.141942
H  -7.173248 0.95932 0.139933
H  2.599747 -3.547344 2.282641
H  2.076889 -3.494502 -2.032471
H  1.752258 -4.6378 0.183041
H  4.520952 4.272463 -0.636097
H  -0.988156 -3.388882 -0.406926
H  -1.479348 -3.387388 1.331706
H  -1.355194 -4.938483 0.432134
