program: Gaussian 09
title: 000145907
version: EM64L-G09RevD.01
frameworkgroup: C1[X(C15H17FN4O3)]
method: RPBEPBE
basis: SDD
operation: Freq
keyword: #p
keyword: freq=noraman
keyword: PBEPBE/SDD
title: #p freq=noraman PBEPBE/SDD
converged: YES YES NO NO
title: Mulliken charges:
elementType: F O O O N N N N C C C C C C C C C C C C C C C H H H H H H H H H H H H H H H H H
charge: -0.205780 -0.226912 -0.380712 -0.292926 -0.170274 -0.297954 -0.164982 -0.309542 -0.353975 -0.358814 -0.424069 -0.414470 0.336451 0.315167 -0.488597 0.175398 0.187589 -0.568565 0.067986 -0.352664 0.115642 0.103365 -0.600718 0.217568 0.217865 0.219280 0.250728 0.215837 0.193958 0.202102 0.216627 0.274181 0.301209 0.304958 0.299063 0.305692 0.231425 0.253581 0.228919 0.376363
chargesum: 0.00000
title: Mulliken charges with hydrogens summed into heavy atoms:
elementType: F O O O N N N N C C C C C C C C C C C C C C C
charge: -0.205780 -0.226912 -0.004349 -0.292926 -0.170274 -0.023774 -0.164982 -0.003849 0.081458 0.111193 -0.014274 0.004258 0.336451 0.315167 -0.187389 0.175398 0.187589 -0.263607 0.067986 -0.053600 0.115642 0.103365 0.113207
polarizability: 3.55703499e+02 1.06398331e+01 2.17230975e+02 -1.80083505e+00 -5.61673172e+00 1.09207222e+02
1716.lowfreq: -6.0050 -2.9122 0.0004 0.0009 0.0009 4.0430 27.4786 37.0219 48.2746
frequency: 27.4406 37.0183 48.2637 54.2908 61.8390 72.8949 97.3728 122.8532 155.5681 171.4837 187.7116 205.1287 223.5944 244.3718 252.9472 272.8096 287.9087 301.9665 325.3206 346.2293 367.0681 372.0499 379.8107 392.7999 441.9356 453.1581 459.8008 470.6486 502.0745 523.7312 538.9345 578.3327 595.7347 610.1400 629.0832 648.0885 683.1910 691.2247 693.2907 704.6724 723.4565 733.3301 768.3856 794.6189 826.2660 844.5873 871.7927 884.0286 922.0578 929.4583 933.5330 945.3729 981.2727 1022.6135 1047.5844 1050.6631 1064.2518 1083.7716 1097.0096 1101.3711 1113.8591 1130.3855 1148.7917 1164.8691 1168.2009 1196.8253 1201.9473 1219.8803 1243.1445 1250.7520 1255.7426 1288.4424 1320.5728 1327.2539 1330.7090 1351.6835 1365.6876 1374.0683 1379.1633 1390.6710 1395.4000 1428.9910 1441.8808 1445.8590 1456.0437 1457.5341 1461.9305 1463.8339 1468.8230 1483.3801 1496.9753 1500.8417 1536.6266 1546.1754 1581.5941 1616.0063 1632.7513 2874.1428 2889.2155 2929.5194 2945.1931 2946.5709 3042.8964 3050.7613 3058.0024 3058.7591 3106.7168 3126.4665 3145.8427 3164.2210 3187.6461 3445.5527 3465.9969 3491.2849
redmass: 6.1591 9.9115 4.5843 3.8343 6.1029 3.0674 4.4489 5.6940 5.4476 4.9092 2.1741 1.9266 3.6484 3.7070 3.0179 3.6496 4.5830 3.7041 5.7350 5.3407 8.0751 3.8101 3.5022 3.3853 4.6747 2.9046 3.9637 4.7155 2.4131 2.9726 5.1800 4.7714 1.6357 3.2575 3.1865 3.6705 1.6903 4.2308 2.7551 4.1067 4.9633 5.0169 4.8430 5.8179 4.2410 1.5178 2.1320 1.9823 1.4487 3.2194 2.2177 1.3949 2.5954 2.9320 3.0929 1.7502 2.0685 3.2289 2.5232 2.1109 1.4144 3.0349 2.5979 1.8297 3.8099 1.8750 1.1823 1.3906 1.5000 2.2442 1.7043 1.3047 2.0280 1.3620 2.1903 1.5419 2.3332 2.6896 2.2607 1.5102 3.8121 1.1858 2.0859 1.3490 1.1046 1.0776 1.1154 1.0696 1.1107 1.6956 1.8893 1.9662 9.4906 8.2418 7.7022 7.6450 8.1011 1.0707 1.0699 1.0672 1.0457 1.0710 1.0901 1.0914 1.0876 1.0927 1.1020 1.0905 1.0927 1.0918 1.0898 1.0761 1.0755 1.0635
irintensity: 0.5217 2.9318 1.7155 0.8844 0.7617 0.3555 1.4682 0.1683 0.4492 0.3662 2.3054 2.5639 2.6841 1.5081 9.1476 8.6737 10.9539 4.2077 6.9970 4.7143 12.6376 1.9401 3.7989 3.8336 10.6334 4.8324 5.8240 15.0132 40.8517 14.9153 22.5535 112.5478 100.2340 23.6729 23.9710 34.9545 67.8105 13.5628 45.1528 16.2511 21.5700 28.5768 5.7627 20.0667 15.5288 0.5325 21.9266 12.3353 23.6156 40.3769 4.6059 11.5596 16.1630 111.1875 288.0701 4.3958 9.1349 28.2067 25.5788 49.8229 1.4763 28.4137 63.8494 41.1580 21.7012 21.1940 6.5374 13.9466 21.9481 161.4334 146.7604 72.7998 18.7892 45.1659 9.7769 0.6323 21.1433 25.7973 77.6922 12.0334 14.9984 4.8665 9.1340 4.7835 38.3909 8.2706 81.0733 0.5048 2.9591 100.3195 319.5963 113.3568 43.8726 79.0902 448.6321 284.2520 246.6127 80.2108 91.0522 55.0189 63.2585 84.7049 46.7120 54.6564 23.8569 23.4580 19.3222 5.2173 4.3091 8.0396 5.5543 3.6935 1.0266 34.3763
temp: 298.150 k
press: 1.00000 atm
elementType: 9 8 8 8 7 7 7 7 6 6 6 6 6 6 6 6 6 6 6 6 6 6 6 1 1 1 1 1 1 1 1 1 1 1 1 1 1 1 1 1
symmnumber: 1
zpe: 815998.5 jmol-1
zpe.correction: 0.310797 hartree
zpe.thermalcorrener: 0.331650 hartree
zpe.thermalcorrenthalpy: 0.332594 hartree
zpe.thermalcorrgfe: 0.260320 hartree
zpe.sumelectzpe: -1124.588556 hartree
zpe.sumelectthermal: -1124.567704 hartree
zpe.sumelectthermalent: -1124.566760 hartree
zpe.sumelectthermalfe: -1124.639033 hartree
dipole: 5.7576 7.0817 -0.1821
dipole: 9.1287
quadrupole: -128.7103 -130.0382 -133.8061
quadrupole: -6.6411 4.0857 3.9126
quadrupole: 2.1412 0.8134 -2.9546 -6.6411 4.0857 3.9126
hfenergy: -1124.8993533 hartree
pointgroup: C01 [X(C15H17F1N4O3)]
dipole: -2.2913245 -2.7633928 0.1115451 debye
polarizability: 355.8856687|9.4506465|217.3070029|1.6169468|-1.7022762|108.9490243 unknown
InChI: InChI=1S/C15H17FN4O3/c1-17-20-8-10(15(22)23)14(21)9-6-11(16)13(7-12(9)20)19-4-2-18-3-5-19/h6-8,17-18,22H,2-5H2,1H3
charge 0 multiplicity 1
40 atoms
F  -2.145315 2.758817 0.210335
O  2.904399 2.473793 0.079435
O  5.467446 1.370195 -0.056827
O  5.623625 -0.932794 -0.196024
N  -3.156751 0.087305 -0.081871
N  -5.950051 -0.529486 -0.204796
N  1.525366 -1.464965 -0.201294
N  1.051116 -2.814643 -0.278306
C  -3.6279 -1.3048 0.099116
C  -4.09114 0.919242 -0.89427
C  -5.059216 -1.312363 0.67399
C  -5.50891 0.879115 -0.299633
C  -1.778593 0.346742 -0.08955
C  0.571493 -0.413733 -0.124025
C  -0.811862 -0.693569 -0.168232
C  1.068708 0.919702 -0.028931
C  -1.245184 1.676505 0.041064
C  0.110915 1.963786 0.055816
C  2.522642 1.262283 -0.009991
C  2.871331 -1.198046 -0.182953
C  3.415992 0.082474 -0.105686
C  4.899226 0.103712 -0.124602
C  1.230541 -3.582132 0.979465
H  -2.958731 -1.822443 0.807839
H  -3.620957 -1.857517 -0.867293
H  -4.128913 0.514499 -1.929446
H  -3.728573 1.954991 -0.93071
H  -5.417519 -2.356747 0.723225
H  -5.014596 -0.907784 1.715619
H  -5.491344 1.395423 0.690838
H  -6.193413 1.43128 -0.96824
H  -6.942396 -0.625334 0.042645
H  -1.109695 -1.733613 -0.308854
H  0.472175 2.991821 0.160402
H  3.548179 -2.057786 -0.24074
H  1.451754 -3.272614 -1.10839
H  0.842927 -4.601224 0.809957
H  0.63385 -3.113036 1.779028
H  2.285853 -3.651132 1.320174
H  6.45832 1.257674 -0.075484
