program: Gaussian 09
title: 000146001
version: EM64L-G09RevD.01
frameworkgroup: C1[X(C27H29FN2O)]
method: RPBEPBE
basis: SDD
operation: Freq
keyword: #p
keyword: freq=noraman
keyword: PBEPBE/SDD
title: #p freq=noraman PBEPBE/SDD
converged: YES YES NO NO
title: Mulliken charges:
elementType: F O N N C C C C C C C C C C C C C C C C C C C C C C C C C C C H H H H H H H H H H H H H H H H H H H H H H H H H H H H H
charge: -0.198539 -0.226566 -0.140037 -0.089486 -0.366347 -0.380953 -0.385375 -0.384077 -0.312078 -0.339838 -0.444709 0.466262 0.447054 -0.503577 -0.454934 -0.434631 -0.349182 -0.370981 0.118148 -0.224990 -0.225696 -0.241475 -0.246464 -0.244808 -0.244592 0.293544 -0.310254 -0.320711 -0.387399 -0.372287 0.331711 0.232947 0.185127 0.189855 0.235735 0.187512 0.204482 0.214391 0.190363 0.194909 0.192106 0.196667 0.219953 0.235330 0.224000 0.272345 0.228405 0.226312 0.244191 0.260169 0.224004 0.223068 0.224204 0.223747 0.227421 0.227402 0.255272 0.284174 0.258325 0.260848
chargesum: 0.00000
title: Mulliken charges with hydrogens summed into heavy atoms:
elementType: F O N N C C C C C C C C C C C C C C C C C C C C C C C C C C C
charge: -0.198539 -0.226566 -0.140037 -0.089486 0.051728 0.044638 0.006619 0.020678 -0.117169 0.048934 0.010573 0.466262 0.447054 -0.007232 -0.226529 -0.208320 -0.104991 -0.110812 0.118148 -0.000986 -0.002628 -0.017271 -0.022717 -0.017387 -0.017190 0.293544 -0.054981 -0.036537 -0.129073 -0.111439 0.331711
polarizability: 3.29682382e+02 -1.47300002e+00 3.15520437e+02 3.16194148e+01 1.31934837e+01 2.70194695e+02
1716.lowfreq: -14.2980 -6.3893 -5.6474 -0.0004 0.0005 0.0008 3.0894 7.9579 15.8984
frequency: -6.9846 6.7120 15.7647 24.1593 32.9333 41.9432 48.1639 52.6144 70.6208 76.8099 92.6062 96.4349 121.0882 147.3831 177.0705 203.8882 214.2755 224.6883 245.8684 258.3762 262.9320 269.7906 279.7832 286.4189 320.3638 339.5130 352.2552 374.5123 403.0426 408.0618 410.0905 410.6059 446.4820 463.3552 468.8651 479.3254 484.6660 507.6996 539.3450 569.6359 582.0841 604.6278 610.5759 617.6823 622.4223 624.8550 646.6287 700.8388 711.3324 718.8999 733.0747 754.4681 755.5420 761.1060 796.7951 812.1907 815.1035 822.8472 832.0502 846.5589 848.3722 849.5055 852.5667 861.4294 882.3221 920.5426 935.9304 947.3882 950.0241 961.6717 976.0320 984.7537 988.1632 989.7487 991.3077 994.5399 996.6525 999.4636 1003.7111 1007.5868 1024.7618 1025.9271 1035.9402 1053.3751 1070.7570 1073.7167 1080.5756 1089.4447 1104.1174 1105.2025 1120.1492 1128.3899 1135.1512 1148.9491 1155.4464 1169.6323 1171.3146 1178.0515 1185.4809 1186.5009 1188.7604 1195.3998 1200.3116 1204.3702 1214.4805 1240.3602 1262.9502 1270.4913 1274.9786 1283.7749 1291.1740 1296.6196 1308.4077 1313.7887 1328.5267 1334.9184 1338.0220 1347.9963 1357.4338 1368.3532 1379.5926 1380.4506 1383.2759 1389.4102 1393.4017 1408.6858 1438.8703 1439.4035 1440.5027 1452.4832 1459.3801 1461.3553 1470.5231 1474.6555 1476.2081 1476.7853 1480.5839 1490.1265 1570.5160 1592.4693 1594.1622 1600.8155 1608.2610 1612.0704 1612.8364 2824.3378 2853.0716 2856.5211 2864.4570 2868.3498 2878.7317 2949.6897 2999.5608 3001.6414 3010.9930 3026.3040 3045.4606 3063.7394 3066.5315 3070.3985 3111.8743 3114.1776 3121.4587 3124.0890 3134.5171 3137.2579 3144.7957 3149.9793 3155.4455 3157.1091 3161.0967 3162.9365 3177.2272 3180.3269
redmass: 5.7957 6.6703 5.9855 3.7616 4.6357 5.3914 4.5919 4.3533 3.8978 3.5699 5.6394 4.8414 4.3858 3.1352 3.2793 3.7655 4.0348 4.8838 3.2787 3.6546 2.9827 3.1077 3.5720 6.0914 3.6802 2.6085 3.0094 6.3208 2.8022 2.7716 2.2964 2.9430 3.5099 4.0001 3.6160 3.1874 3.0920 3.4147 3.1997 2.2105 6.4248 5.3884 3.8781 6.1164 3.5490 7.1776 3.8054 1.8446 1.7036 2.6374 2.7237 1.7963 4.9544 2.3991 2.0154 4.8092 2.8922 1.4289 2.7424 3.0834 1.5312 1.6036 1.3219 1.2581 2.0587 1.4428 1.5130 1.7651 2.1942 1.6335 1.3956 1.4049 1.3613 5.9701 5.1307 1.3386 3.5646 1.7459 1.8571 2.3875 2.1193 2.2470 2.2351 1.8715 1.9133 1.6365 1.7719 2.0716 1.3243 2.3411 2.6002 1.8541 3.0588 2.7518 1.4202 1.0860 1.0609 1.1942 1.4188 1.3419 1.7727 1.7125 2.1682 1.7443 1.7958 1.5315 1.7474 1.1826 1.3394 1.5616 1.2819 1.3640 1.2713 1.4972 1.2922 1.3495 1.2803 1.3227 1.6473 1.4676 2.9607 5.3204 6.4768 1.4515 2.0869 4.0615 2.0834 1.1112 2.1329 1.0822 1.0817 1.0878 1.0950 1.0985 1.0999 2.2493 2.2623 2.5794 7.9102 6.0272 6.1959 7.1961 6.1285 7.2002 6.1500 1.0812 1.0708 1.0702 1.0701 1.0707 1.0686 1.0614 1.0880 1.0913 1.0670 1.0892 1.0892 1.0880 1.0995 1.0881 1.0872 1.0868 1.0859 1.0864 1.0910 1.0918 1.0958 1.0951 1.0884 1.0890 1.1014 1.1011 1.0964 1.0974
irintensity: 0.0603 0.0497 0.9971 0.1330 0.1555 0.1738 0.0555 0.1670 0.2959 0.2260 3.6262 0.3135 0.5932 5.9068 0.9640 1.3751 0.5613 8.2174 2.1906 0.2178 3.6339 1.5876 0.7460 0.7400 0.0923 12.2081 0.9592 3.4845 0.0430 0.2441 0.2904 0.0600 1.0802 3.2824 2.1991 4.4311 4.3041 3.2280 27.9314 9.9381 26.4340 7.4914 0.5556 3.6374 5.7183 0.2971 7.7234 25.8631 80.8295 8.7640 24.3853 38.3085 6.1594 24.9213 49.2012 16.3975 19.9757 0.9167 3.2484 7.5674 17.9651 30.4242 0.1639 0.1623 21.4883 1.8276 6.6134 18.4147 15.2999 12.2993 0.0402 0.6414 0.6932 0.4596 0.7017 3.8893 20.9344 43.6355 25.3900 3.2565 11.6005 0.8600 10.4425 0.1247 1.7368 1.5839 20.2188 5.9546 11.9959 2.1399 30.0381 19.3049 67.0744 29.4536 85.6025 1.1983 0.3489 3.9965 3.2983 5.5077 3.9441 2.2648 5.5940 21.6333 42.0137 100.7951 19.0239 15.5339 22.8998 69.0646 2.1890 54.3614 10.7589 70.9360 2.1570 4.5130 6.3108 5.6012 62.2151 1.0309 1.2250 18.2572 0.1832 2.5050 4.3596 16.7796 1.0653 16.4205 22.9290 3.1585 1.6589 5.1696 11.1172 16.5145 13.6528 27.9166 8.4687 27.2968 104.9354 0.0729 2.7134 72.8130 11.9749 62.7815 1.5992 41.3982 72.8494 27.2083 21.6883 6.7275 361.8725 80.0515 23.8198 7.7836 26.1056 46.4530 37.8991 21.8544 48.6397 19.3942 7.7385 7.8588 0.3124 0.2695 11.7236 29.1851 21.2217 39.0832 6.4115 0.0596 34.1619 19.8071 4.5606 4.5010
temp: 298.150 k
press: 1.00000 atm
elementType: 9 8 7 7 6 6 6 6 6 6 6 6 6 6 6 6 6 6 6 6 6 6 6 6 6 6 6 6 6 6 6 1 1 1 1 1 1 1 1 1 1 1 1 1 1 1 1 1 1 1 1 1 1 1 1 1 1 1 1 1
symmnumber: 1
zpe: 1297364.7 jmol-1
zpe.correction: 0.494140 hartree
zpe.thermalcorrener: 0.520990 hartree
zpe.thermalcorrenthalpy: 0.521934 hartree
zpe.thermalcorrgfe: 0.432720 hartree
zpe.sumelectzpe: -1328.575536 hartree
zpe.sumelectthermal: -1328.548686 hartree
zpe.sumelectthermalent: -1328.547742 hartree
zpe.sumelectthermalfe: -1328.636956 hartree
dipole: -1.9585 2.0621 -0.9045
dipole: 2.9843
quadrupole: -199.1267 -179.8652 -174.7844
quadrupole: 3.5264 -2.5558 -3.4736
quadrupole: -14.5346 4.7269 9.8077 3.5264 -2.5558 -3.4736
hfenergy: -1329.069676 hartree
pointgroup: C01 [X(C27H29F1N2O1)]
dipole: -0.8278949 -0.6438091 -0.5278616 debye
polarizability: 330.8309208|26.6959713|266.1719854|-12.9408903|9.1872008|318.3946084 unknown
InChI: InChI=1S/C27H29FN2O/c28-25-15-13-22(14-16-25)26(31)12-7-17-29-18-20-30(21-19-29)27(23-8-3-1-4-9-23)24-10-5-2-6-11-24/h1-6,8-11,13-16,27H,7,12,17-21H2
charge 0 multiplicity 1
60 atoms
F  8.028165 0.909445 -3.369554
O  5.037316 -0.052923 2.220264
N  -2.009237 -0.386507 0.394652
N  0.535804 -1.630399 1.11407
C  -1.434045 -1.502937 -0.402297
C  -0.894515 0.399537 0.991638
C  -0.567889 -2.40359 0.492424
C  -0.019634 -0.490809 1.886704
C  -2.9440 0.479759 -0.387155
C  1.453484 -2.484717 1.909888
C  2.811702 -1.804687 2.188165
C  -4.024827 -0.348738 -1.100364
C  -3.614375 1.53038 0.516867
C  3.524891 -1.419684 0.880806
C  -4.263436 -0.16414 -2.483055
C  -3.926654 2.808953 -0.004484
C  -4.82437 -1.2777 -0.386207
C  -3.983727 1.226837 1.851622
C  4.738862 -0.51743 1.078573
C  -5.283331 -0.887045 -3.144802
C  -4.602033 3.766552 0.785709
C  -5.837399 -2.006434 -1.044284
C  -4.653368 2.182805 2.645695
C  -6.074049 -1.811872 -2.426645
C  -4.969286 3.455883 2.115248
C  5.582255 -0.167084 -0.119677
C  5.262506 -0.599798 -1.435569
C  6.738626 0.6363 0.081747
C  6.076012 -0.242454 -2.530895
C  7.564894 1.001758 -0.997052
C  7.210268 0.550416 -2.282361
H  -2.252566 -2.100674 -0.835833
H  -0.804353 -1.115263 -1.24287
H  -0.252692 0.849032 0.192196
H  -1.312659 1.223445 1.593528
H  -1.226645 -2.87413 1.265844
H  -0.130848 -3.213342 -0.121834
H  0.810503 0.114855 2.291536
H  -0.633702 -0.852865 2.750449
H  -2.381267 1.036157 -1.182615
H  1.62586 -3.412859 1.328964
H  0.989021 -2.792751 2.880936
H  3.443321 -2.492304 2.781995
H  2.685454 -0.903288 2.814235
H  3.833312 -2.330027 0.326394
H  2.786147 -0.909411 0.224981
H  -3.646823 0.54743 -3.046681
H  -3.644017 3.056005 -1.035829
H  -4.640086 -1.429921 0.682711
H  -3.720443 0.244512 2.259852
H  -5.456581 -0.731409 -4.21571
H  -4.837287 4.751881 0.367471
H  -6.446851 -2.722606 -0.481157
H  -4.928967 1.936816 3.677777
H  -6.8645 -2.374733 -2.935849
H  -5.490568 4.197439 2.73111
H  4.374259 -1.212901 -1.615331
H  6.964875 0.962432 1.101906
H  5.846339 -0.563284 -3.550855
H  8.458558 1.617186 -0.860288
