program: Gaussian 09
title: 000145879
version: EM64L-G09RevD.01
frameworkgroup: C1[X(C12H12N2O2)]
method: RPBEPBE
basis: SDD
operation: Freq
keyword: #p
keyword: freq=noraman
keyword: PBEPBE/SDD
title: #p freq=noraman PBEPBE/SDD
converged: YES YES NO NO
title: Mulliken charges:
elementType: O O N N C C C C C C C C C C C C H H H H H H H H H H H H
charge: -0.450572 -0.214243 -0.362022 -0.474528 0.144478 0.191316 -0.228562 -0.466464 -0.431511 0.157774 0.212111 -0.418808 0.172343 -0.369955 -0.254781 -0.222382 0.240654 0.206107 0.230776 0.195126 0.220896 0.297269 0.335431 0.231185 0.229940 0.217926 0.218920 0.391577
chargesum: 0.00000
title: Mulliken charges with hydrogens summed into heavy atoms:
elementType: O O N N C C C C C C C C C C C C
charge: -0.058996 -0.214243 -0.064753 -0.139097 0.144478 0.191316 0.012092 -0.029582 -0.015489 0.157774 0.212111 -0.187623 0.172343 -0.140015 -0.036855 -0.003462
polarizability: 2.08964243e+02 -5.62153893e+00 1.54473187e+02 -3.44067439e+00 -6.82032272e+00 7.80905688e+01
1716.lowfreq: -7.3420 -3.7822 -0.0010 -0.0004 -0.0004 8.6257 47.5068 64.8864 85.7459
frequency: 47.5005 64.8799 85.7452 137.2028 154.9295 217.7776 228.3773 274.9756 313.2531 324.8725 333.7778 419.9450 423.0234 446.5976 466.0294 508.6551 550.8514 569.6153 576.1274 592.3457 600.4240 615.1760 649.2741 654.9185 721.9560 747.8452 758.8557 775.0426 837.5923 848.9125 861.7143 885.7004 920.3371 927.8148 967.8017 988.3586 1010.9949 1012.7120 1058.1265 1067.5622 1111.7770 1151.1309 1168.7709 1176.4957 1190.2759 1218.2265 1225.2233 1237.9112 1247.9704 1266.5059 1304.8293 1310.2259 1324.8011 1353.2340 1372.5307 1406.7397 1438.9203 1446.6259 1455.6265 1469.4882 1475.3732 1481.7312 1579.2301 1596.3044 1632.7646 1676.0391 2742.8141 2872.2434 2974.2701 3025.8773 3053.9211 3121.4668 3129.2255 3143.1334 3161.0480 3518.6737 3523.1832 3588.0703
redmass: 11.0048 4.4349 5.2155 5.4308 3.1562 4.1110 3.9325 3.8160 4.1254 3.4508 6.7970 2.5534 2.0025 3.0742 3.0158 3.7200 3.5634 3.4306 4.3276 1.3531 2.2429 2.7975 1.9629 4.4616 2.9849 1.3629 3.7297 5.5751 3.7145 1.6017 3.7146 4.0747 2.2961 1.3868 1.2992 3.8484 2.0263 2.7461 1.9736 2.2572 1.6957 1.8333 1.2273 3.2734 1.2000 1.4188 1.2693 1.8819 1.6359 1.5096 2.4464 1.3660 2.4002 1.6436 1.7685 3.7384 1.8829 2.2689 1.1078 1.4186 2.3489 3.0821 6.6348 6.9185 7.1983 9.3189 1.0749 1.0716 1.0595 1.1009 1.0905 1.0846 1.0890 1.0952 1.1001 1.0642 1.0764 1.0805
irintensity: 0.7580 0.6671 2.0028 0.9127 4.4409 0.3971 3.9009 2.8981 5.9292 0.3915 1.3360 40.0718 31.2493 12.9621 36.3543 18.5065 10.6171 21.8443 8.7408 9.7973 50.2283 46.9912 160.5116 11.9533 6.6120 104.8134 7.0298 5.4644 1.4857 0.1943 3.0251 0.1631 22.4522 2.9281 0.0097 39.0271 7.7286 28.6115 5.0263 185.6426 6.7325 15.0888 5.6553 17.9865 2.5518 8.5444 7.0858 6.1347 23.1295 14.4024 33.2638 14.1864 14.3833 28.4098 15.4733 20.1065 5.5982 26.0504 5.2936 21.8957 20.3693 6.9638 0.7109 10.5961 7.9978 283.8537 90.0321 112.8390 39.9081 32.1760 52.0090 1.2412 3.6016 38.1621 35.2739 32.7119 8.2684 107.6828
temp: 298.150 k
press: 1.00000 atm
elementType: 8 8 7 7 6 6 6 6 6 6 6 6 6 6 6 6 1 1 1 1 1 1 1 1 1 1 1 1
symmnumber: 1
zpe: 579113.9 jmol-1
zpe.correction: 0.220573 hartree
zpe.thermalcorrener: 0.233595 hartree
zpe.thermalcorrenthalpy: 0.234539 hartree
zpe.thermalcorrgfe: 0.180920 hartree
zpe.sumelectzpe: -723.293372 hartree
zpe.sumelectthermal: -723.280350 hartree
zpe.sumelectthermalent: -723.279405 hartree
zpe.sumelectthermalfe: -723.333025 hartree
dipole: -1.2160 -1.2550 1.6382
dipole: 2.3953
quadrupole: -95.3518 -74.0176 -98.1553
quadrupole: 1.9555 -6.5891 0.0560
quadrupole: -6.1769 15.1573 -8.9804 1.9555 -6.5891 0.0560
hfenergy: -723.5139447 hartree
pointgroup: C01 [X(C12H12N2O2)]
dipole: -0.4720579 -0.4911534 0.6511556 debye
polarizability: 209.0027385|-5.3220133|154.2717746|-3.9608194|-7.5004574|78.2534855 unknown
InChI: InChI=1S/C12H12N2O2/c15-12(16)11-10-8(5-6-13-11)7-3-1-2-4-9(7)14-10/h1-4,11,13-15H,5-6H2
charge 0 multiplicity 1
28 atoms
O  -2.397777 -2.382209 0.103991
O  -4.060807 -0.981128 -0.709231
N  -2.607255 1.298502 0.006007
N  0.14516 -1.221158 0.430002
C  0.161432 1.030517 0.008161
C  -0.644017 -0.07152 0.287062
C  -2.13894 0.003938 0.509933
C  -0.401612 2.419449 -0.168929
C  -1.825087 2.470395 0.446037
C  1.526292 0.544022 -0.051622
C  1.483879 -0.875109 0.211997
C  2.781629 1.160865 -0.29724
C  -2.967154 -1.115827 -0.13012
C  2.64781 -1.673906 0.22237
C  3.946039 0.367907 -0.283333
C  3.879719 -1.034372 -0.028237
H  -2.324426 -0.135549 1.615338
H  0.241352 3.177708 0.319753
H  -0.459581 2.679414 -1.244243
H  -1.732186 2.525746 1.559123
H  -2.3543 3.379071 0.109118
H  -3.625671 1.399624 0.012107
H  -0.242792 -2.157627 0.536363
H  2.844471 2.236365 -0.49891
H  2.603771 -2.750769 0.420617
H  4.921408 0.830265 -0.472462
H  4.8034 -1.624083 -0.025701
H  -2.994956 -3.084831 -0.27045
