program: Gaussian 09
title: 000145901
version: EM64L-G09RevD.01
frameworkgroup: C1[X(C16H23NO)]
method: RPBEPBE
basis: SDD
operation: Freq
keyword: #p
keyword: freq=noraman
keyword: PBEPBE/SDD
title: #p freq=noraman PBEPBE/SDD
converged: NO YES NO NO
title: Mulliken charges:
elementType: O N C C C C C C C C C C C C C C C C H H H H H H H H H H H H H H H H H H H H H H H
charge: -0.438908 -0.068065 0.230320 -0.058973 -0.133369 -0.492939 -0.513401 -0.443896 -0.425636 -0.441368 0.502151 -0.787079 -0.634230 -0.570238 -0.437875 0.261393 -0.214582 -0.381226 0.174992 0.209499 0.215909 0.215536 0.224586 0.193293 0.195592 0.209434 0.212631 0.204486 0.180497 0.215176 0.202831 0.245841 0.233378 0.222548 0.187804 0.221375 0.212533 0.246691 0.222082 0.251178 0.350028
chargesum: 0.00000
title: Mulliken charges with hydrogens summed into heavy atoms:
elementType: O N C C C C C C C C C C C C C C C C
charge: -0.088880 -0.068065 0.230320 0.116019 0.076130 -0.061494 -0.095522 -0.038870 -0.008519 -0.045696 0.502151 -0.105029 -0.002503 -0.357704 -0.191183 0.261393 0.007500 -0.130048
polarizability: 2.22460698e+02 -1.91998406e+00 1.70361276e+02 -3.28619284e+00 -7.69827418e+00 1.32825686e+02
1716.lowfreq: -22.2232 -10.5910 -9.6241 -0.0007 -0.0007 0.0006 33.4025 65.3920 91.4061
frequency: 32.4766 65.2788 91.3573 121.5978 146.6859 167.1550 202.2730 222.7725 225.0757 238.1049 250.6765 260.1079 286.0328 295.9929 315.4772 323.3999 357.7073 387.5843 399.6038 428.7043 447.4911 457.6768 476.9573 514.9440 526.2558 586.0024 611.5238 624.3899 663.7778 675.6483 697.9065 757.1664 782.6338 787.5771 819.2983 835.9679 848.3003 860.5151 886.2179 893.2363 909.4364 951.9346 966.1365 970.5876 972.1898 985.4718 1015.7723 1027.9138 1037.2077 1074.0887 1077.3094 1081.1778 1093.8455 1106.0219 1110.5355 1128.0323 1136.7022 1143.7280 1152.9122 1172.1531 1178.7606 1191.4478 1205.3763 1224.0510 1242.3203 1259.6596 1266.9529 1288.3475 1295.4370 1312.0210 1315.7246 1323.6915 1326.0470 1340.1808 1342.1791 1356.4395 1361.1018 1375.4516 1382.1009 1385.7122 1428.6619 1433.5057 1453.5533 1457.5101 1464.1425 1466.8384 1469.1870 1476.0816 1490.6344 1491.6419 1494.4241 1520.4256 1605.4174 1611.1845 2850.5691 2868.6104 2953.1867 2957.0879 2966.0994 2969.4322 2972.5104 2981.5216 2987.1899 2990.0633 3000.5103 3015.4109 3020.7215 3041.7321 3052.7398 3062.4537 3068.0233 3091.7353 3100.6217 3133.2404 3165.8276 3176.4105 3578.5473
redmass: 4.1051 3.6531 3.4855 3.2772 2.3047 1.3784 1.7546 1.5553 2.8590 2.0172 3.5774 2.9195 3.3177 2.9272 2.4483 2.6323 1.1259 3.0449 2.0218 3.4612 2.9423 3.2643 2.7710 4.6735 4.7331 2.4077 4.5222 4.2614 3.5896 3.7713 2.0452 1.9254 2.7169 1.5541 2.2660 2.6141 1.7271 1.8426 1.4729 1.7654 2.3050 2.1465 1.7783 2.0942 1.5247 6.0091 1.6200 1.6745 2.2784 1.9048 2.1731 1.6938 1.7271 1.5168 1.5943 1.8516 1.6685 1.9989 1.9848 1.5768 1.2577 1.5726 1.9946 1.7388 1.3437 2.4373 1.6574 1.4931 1.4285 1.4590 1.4659 1.3506 1.3389 1.4271 1.4549 1.4176 1.3035 1.3973 1.6325 2.8640 2.8642 1.1711 1.0789 1.0966 1.0682 1.0707 1.0593 1.0850 1.0689 1.2699 1.7104 1.0801 6.1928 6.4714 1.0581 1.0710 1.0729 1.0784 1.0607 1.0781 1.0760 1.0399 1.0654 1.0661 1.0721 1.0973 1.1007 1.1014 1.0991 1.1002 1.0970 1.0995 1.0896 1.0875 1.0916 1.0977 1.0659
irintensity: 0.0838 0.1193 0.1288 0.9124 0.0093 0.6420 1.8603 0.0287 0.8009 1.3932 0.7554 0.5549 0.8006 1.5945 1.1923 2.2925 135.1296 4.1954 1.7104 0.7684 16.2481 13.1294 0.4708 2.0302 0.6730 0.8066 0.8618 1.5390 2.6964 3.4410 26.5754 3.8762 10.6021 37.6025 4.7448 15.1871 6.5347 17.5432 3.7233 14.2525 6.1337 3.3834 9.8945 5.9296 0.5637 0.9702 10.4469 10.4248 14.5772 19.6869 8.0209 12.8300 6.0386 7.2262 4.0815 53.5470 105.7034 4.5407 94.2168 0.7871 2.2777 3.7568 4.4204 5.5680 0.5861 18.5987 0.7145 12.3728 7.6733 4.3923 5.1410 2.3467 2.7731 4.0156 3.9818 6.0000 1.0059 21.0182 11.8585 2.4393 62.7188 8.6367 13.3284 4.1418 12.7216 9.5145 10.9638 13.2164 3.4496 2.9051 21.9674 9.1434 94.4346 44.7916 89.2442 151.9160 13.8286 13.7215 32.4581 71.7459 62.8596 57.8573 97.3248 12.7301 57.7040 37.3300 17.5506 32.2659 70.4282 32.5309 37.0636 19.7967 19.0679 13.1101 11.5293 11.8250 27.1495
temp: 298.150 k
press: 1.00000 atm
elementType: 8 7 6 6 6 6 6 6 6 6 6 6 6 6 6 6 6 6 1 1 1 1 1 1 1 1 1 1 1 1 1 1 1 1 1 1 1 1 1 1 1
symmnumber: 1
zpe: 936228.4 jmol-1
zpe.correction: 0.356591 hartree
zpe.thermalcorrener: 0.373377 hartree
zpe.thermalcorrenthalpy: 0.374321 hartree
zpe.thermalcorrgfe: 0.313598 hartree
zpe.sumelectzpe: -752.081191 hartree
zpe.sumelectthermal: -752.064405 hartree
zpe.sumelectthermalent: -752.063461 hartree
zpe.sumelectthermalfe: -752.124184 hartree
dipole: 2.2703 -0.9953 -0.6706
dipole: 2.5680
quadrupole: -116.4319 -99.5400 -113.6861
quadrupole: -0.7429 -0.7333 -3.9154
quadrupole: -6.5459 10.3460 -3.8001 -0.7429 -0.7333 -3.9154
hfenergy: -752.437782 hartree
pointgroup: C01 [X(C16H23N1O1)]
dipole: 0.892874 0.4380264 0.1778927 debye
polarizability: 222.3808592|2.5752322|164.6780072|4.0036347|-15.4534615|138.5887938 unknown
InChI: InChI=1S/C16H23NO/c1-12-15-7-4-8-16(12,9-10-17(15)2)13-5-3-6-14(18)11-13/h3,5-6,11-12,15,18H,4,7-10H2,1-2H3
charge 0 multiplicity 1
41 atoms
O  -4.303934 1.549565 -0.992113
N  3.067148 -0.638869 -0.478507
C  0.277199 -0.069737 0.351443
C  0.888984 0.428262 -1.009139
C  2.412191 0.65617 -0.800218
C  0.483835 1.066551 1.420084
C  0.999322 -1.396119 0.743372
C  2.642766 1.8167 0.218263
C  1.932712 1.594899 1.578335
C  2.545318 -1.349363 0.707374
C  -1.25335 -0.290861 0.242528
C  0.61164 -0.492698 -2.216188
C  4.53559 -0.619874 -0.529459
C  -2.067973 0.716905 -0.342597
C  -1.901617 -1.442493 0.758274
C  -3.470658 0.57171 -0.411942
C  -3.309142 -1.578059 0.688727
C  -4.1092 -0.577811 0.1055
H  0.454832 1.426531 -1.22882
H  2.842634 0.978792 -1.771755
H  0.10332 0.710993 2.398224
H  -0.169088 1.913174 1.127722
H  0.659447 -2.186617 0.048066
H  0.694753 -1.70788 1.761455
H  2.260694 2.748408 -0.24913
H  3.728271 1.971011 0.377357
H  2.524211 0.902732 2.202525
H  1.898688 2.551642 2.136798
H  2.940697 -0.922914 1.661513
H  2.923415 -2.391762 0.66919
H  0.930401 0.002164 -3.153248
H  1.182765 -1.432634 -2.131784
H  -0.462404 -0.73253 -2.307315
H  4.920404 -1.657287 -0.521489
H  5.016175 -0.079433 0.325389
H  4.871181 -0.138769 -1.466353
H  -1.605091 1.622889 -0.757992
H  -1.320368 -2.246145 1.216788
H  -3.786173 -2.477225 1.094825
H  -5.197487 -0.664584 0.040304
H  -3.768107 2.309768 -1.329606
