program: Gaussian 09
title: 000145889
version: EM64L-G09RevD.01
frameworkgroup: C1[X(C12H14N2O3)]
method: RPBEPBE
basis: SDD
operation: Freq
keyword: #p
keyword: freq=noraman
keyword: PBEPBE/SDD
title: #p freq=noraman PBEPBE/SDD
converged: NO YES NO NO
title: Mulliken charges:
elementType: O O O N N C C C C C C C C C C C C H H H H H H H H H H H H H H
charge: -0.258757 -0.254648 -0.431519 -0.345012 -0.344471 -0.001154 -0.395607 0.404136 0.134538 0.127461 -0.366833 -0.733229 -0.357116 -0.357729 -0.400954 -0.364549 0.282124 0.225233 0.223684 0.230858 0.259820 0.329293 0.330395 0.242075 0.243144 0.211613 0.269370 0.268038 0.221742 0.253106 0.354949
chargesum: 0.00000
title: Mulliken charges with hydrogens summed into heavy atoms:
elementType: O O O N N C C C C C C C C C C C C
charge: -0.258757 -0.254648 -0.076570 -0.015719 -0.014075 -0.001154 0.053310 0.404136 0.134538 0.127461 0.123845 -0.036397 -0.087746 -0.089692 -0.179213 -0.111442 0.282124
polarizability: 1.76193121e+02 -9.74178742e-01 1.41781089e+02 4.32691264e+00 -4.51384926e+00 1.22055480e+02
1716.lowfreq: -12.8742 0.0005 0.0007 0.0010 3.8160 9.2405 20.9956 51.2557 79.5476
frequency: 20.9493 51.0710 79.5383 110.4764 134.1364 147.4015 162.4446 171.9025 204.4390 231.8911 262.6809 281.0543 307.3811 359.9503 365.6653 366.2773 404.6887 411.3634 456.5972 474.5548 488.0807 507.8353 538.6793 557.7262 567.8876 622.3542 633.7874 689.0288 690.1647 727.8145 752.1810 771.3858 803.3550 813.4124 839.6553 896.1983 921.6353 934.5727 951.7124 971.7331 984.5408 1005.2970 1076.7753 1086.6206 1091.9071 1110.4746 1135.3809 1144.4449 1150.5226 1172.5388 1192.8765 1228.2639 1253.2416 1264.4742 1295.2523 1323.8447 1328.3021 1347.4685 1349.9376 1382.4521 1385.3376 1418.5081 1423.3646 1424.7492 1447.9884 1483.4689 1489.1112 1489.7570 1499.9806 1591.8488 1611.7749 1623.6242 1643.7613 2946.6998 2991.4476 3015.3738 3067.4415 3070.9660 3081.4932 3104.7301 3114.4000 3141.3403 3146.1614 3171.4341 3549.4759 3550.5452 3581.9527
redmass: 3.8591 5.2416 4.8923 5.1892 3.0879 3.9294 4.8978 6.0456 1.4666 2.3710 2.7266 4.6287 2.7207 5.3171 1.2926 3.5077 3.7188 3.0536 5.2915 3.0720 2.4964 1.5590 2.7334 4.5455 1.8968 4.6615 6.9760 4.6593 5.6385 3.9759 1.4077 5.6527 6.5979 1.3693 1.4800 3.9511 2.3150 2.3345 1.4811 1.3566 1.8856 2.9713 2.5757 2.4182 2.1379 1.5092 3.7134 1.5118 1.7154 3.4447 1.1635 4.4372 2.5262 1.1875 1.1725 1.3357 1.6290 1.4112 2.1963 4.7536 1.2228 1.7765 2.1712 2.7778 1.1021 1.0431 1.0630 1.0832 2.4274 6.3696 6.0211 6.1684 6.9145 1.0701 1.0358 1.0600 1.0939 1.1019 1.0975 1.1022 1.0890 1.0893 1.0950 1.0957 1.0768 1.0787 1.0660
irintensity: 1.1601 8.4561 3.4063 0.3598 0.5215 0.0686 0.2306 0.5227 2.2495 0.3858 1.9245 2.9046 5.7711 2.9469 93.9210 54.2203 11.0811 1.7928 6.3615 16.5468 58.4524 0.3130 46.4649 0.6586 169.0334 1.5635 1.0775 27.4163 3.3466 0.5900 9.4258 6.0400 24.0477 29.2909 39.3925 14.0654 3.0783 18.7919 5.8113 0.6766 12.9391 7.8085 2.5950 9.9241 49.7851 58.5629 11.7993 180.0725 40.6585 9.6746 12.3508 5.7894 25.5577 0.9914 0.1442 14.9046 46.4505 3.5461 108.1390 24.4075 20.3494 28.6561 49.0541 7.7952 34.3864 19.7582 1.5294 13.8265 114.6677 11.7616 217.6152 36.1710 311.2261 53.1407 39.9299 16.3174 28.0292 1.2993 33.3201 20.2989 17.1177 2.0161 3.8673 5.8319 26.2798 41.2791 43.0706
temp: 298.150 k
press: 1.00000 atm
elementType: 8 8 8 7 7 6 6 6 6 6 6 6 6 6 6 6 6 1 1 1 1 1 1 1 1 1 1 1 1 1 1
symmnumber: 1
zpe: 644039.6 jmol-1
zpe.correction: 0.245302 hartree
zpe.thermalcorrener: 0.261154 hartree
zpe.thermalcorrenthalpy: 0.262098 hartree
zpe.thermalcorrgfe: 0.201971 hartree
zpe.sumelectzpe: -799.619947 hartree
zpe.sumelectthermal: -799.604095 hartree
zpe.sumelectthermalent: -799.603151 hartree
zpe.sumelectthermalfe: -799.663278 hartree
dipole: 1.4172 -0.0421 5.5089
dipole: 5.6884
quadrupole: -97.7719 -104.6858 -89.3612
quadrupole: -11.8832 -8.2720 5.2072
quadrupole: -0.4989 -7.4128 7.9117 -11.8832 -8.2720 5.2072
hfenergy: -799.865249 hartree
pointgroup: C01 [X(C12H14N2O3)]
dipole: 0.5038995 0.5654388 -2.1059496 debye
polarizability: 175.9475195|2.2417866|142.7539374|-5.2656499|0.7948604|121.3282329 unknown
InChI: InChI=1S/C12H14N2O3/c1-2-12(8-3-5-9(15)6-4-8)10(16)13-7-14-11(12)17/h3-6,13-15H,2,7H2,1H3
charge 0 multiplicity 1
31 atoms
O  -1.812829 2.356492 0.323063
O  -1.827385 -2.336224 0.439564
O  4.788007 -0.062321 -0.104039
N  -1.768303 1.153908 -1.654111
N  -1.77242 -1.234932 -1.595075
C  -0.991176 0.007932 0.408758
C  -1.300254 0.046287 1.937245
C  0.552778 0.005811 0.203296
C  -1.567482 1.276368 -0.287723
C  -1.572026 -1.29062 -0.224131
C  -1.407014 -0.060243 -2.391632
C  -2.799247 0.058369 2.303136
C  1.275477 1.225402 0.178557
C  1.281279 -1.212384 0.141471
C  2.682588 1.233993 0.074644
C  2.685639 -1.216241 0.036759
C  3.387914 0.009392 0.001802
H  -0.813011 -0.836523 2.388969
H  -0.809775 0.948788 2.34434
H  -1.955142 -0.082853 -3.348297
H  -0.317935 -0.067592 -2.611165
H  -2.125915 1.972868 -2.149806
H  -2.133011 -2.076159 -2.049665
H  -3.303509 0.949028 1.890703
H  -3.30492 -0.85256 1.940135
H  -2.913384 0.088834 3.402181
H  0.739432 2.178007 0.253148
H  0.749901 -2.169108 0.19117
H  3.223475 2.189339 0.05831
H  3.250502 -2.151944 -0.008792
H  5.189145 0.841987 -0.098816
