program: Gaussian 09
title: 000145968
version: EM64L-G09RevD.01
frameworkgroup: C1[X(C20H33NO2)]
method: RPBEPBE
basis: SDD
operation: Freq
keyword: #p
keyword: freq=noraman
keyword: PBEPBE/SDD
title: #p freq=noraman PBEPBE/SDD
converged: YES YES NO NO
title: Mulliken charges:
elementType: O O N C C C C C C C C C C C C C C C C C C C C H H H H H H H H H H H H H H H H H H H H H H H H H H H H H H H H H
charge: -0.340727 -0.378584 -0.335345 -0.373659 -0.341708 -0.474883 -0.356612 -0.174247 -0.709873 -0.378854 -0.471531 -0.491482 -0.167692 -0.549519 -0.196846 -0.531926 -0.160839 -0.159895 -0.530504 0.316804 -0.168603 -0.156438 -0.170435 0.206130 0.188053 0.203948 0.202579 0.202703 0.185234 0.188687 0.189364 0.221012 0.203131 0.240985 0.208116 0.210147 0.208298 0.202324 0.256076 0.198030 0.260411 0.227045 0.205976 0.203782 0.219291 0.211102 0.203827 0.241352 0.231641 0.207062 0.205163 0.220421 0.222064 0.219381 0.328514 0.381547
chargesum: 0.00000
title: Mulliken charges with hydrogens summed into heavy atoms:
elementType: O O N C C C C C C C C C C C C C C C C C C C C
charge: -0.340727 0.002963 -0.006831 0.020525 0.064820 -0.086945 0.021439 0.046765 -0.057641 0.039591 -0.013131 -0.033041 0.059354 -0.139761 0.022445 -0.116996 0.080513 0.071745 -0.118279 0.316804 0.051818 0.065626 0.048946
polarizability: 2.71739198e+02 4.54840826e+00 2.29230191e+02 3.02796157e+00 -1.96365255e+00 2.04835781e+02
1716.lowfreq: -11.3509 -9.4392 -6.4977 0.0004 0.0005 0.0008 6.0640 7.2409 18.7347
frequency: -6.3074 4.9925 18.4003 19.3123 29.5543 41.0643 46.8499 49.4581 59.0164 74.1411 81.2437 86.2348 103.9137 120.9153 131.1198 148.9751 150.0202 157.7513 173.8545 187.4256 202.0390 224.9183 244.0348 249.5408 255.5758 264.2189 279.3834 293.7787 313.6380 324.6144 362.6878 380.2716 390.4214 407.9136 414.1734 443.4016 463.1463 486.5056 496.7468 510.9266 513.0168 538.2364 595.9887 699.4316 722.4650 764.8514 772.1178 782.1500 792.9632 822.6595 824.4559 843.3064 852.6851 867.5025 890.8877 898.7131 909.5015 916.0649 926.2575 932.8610 962.7055 967.5007 973.5281 974.6260 980.3324 991.2215 998.8686 1013.4153 1014.9739 1036.7230 1044.4418 1055.9903 1064.6673 1071.5744 1083.9928 1090.7332 1098.8641 1101.2005 1111.4158 1128.2345 1145.3128 1155.8594 1177.9736 1191.6062 1202.1416 1208.6655 1212.6481 1223.5413 1244.1445 1251.5319 1262.3353 1267.6465 1269.8654 1273.4825 1282.8846 1283.9893 1286.6185 1288.8624 1292.3968 1296.5992 1298.5565 1311.8969 1320.4006 1326.0676 1331.1967 1334.3915 1335.2676 1351.1249 1353.2922 1371.3919 1393.6735 1450.4770 1453.0870 1454.9244 1455.1929 1456.4837 1460.6420 1463.0977 1464.1462 1466.4964 1477.0120 1480.6324 1486.8592 1493.2201 1564.3282 1670.4722 1678.4895 1683.4960 1687.7061 2939.2239 2951.4986 2951.8382 2956.5809 2962.1817 2967.1597 2968.4637 2969.1498 2974.8512 2977.5609 2988.5428 2996.7165 3007.4662 3015.9100 3023.9641 3027.5151 3032.9489 3034.1703 3041.9590 3048.6735 3049.7111 3062.7440 3064.5294 3067.1638 3069.7883 3071.1542 3075.8742 3077.5437 3082.0106 3086.8777 3089.4983 3213.9995 3618.6668
redmass: 3.7362 5.4466 4.0589 5.1161 3.9935 5.0876 4.1675 4.8258 3.5662 3.5341 2.2507 2.5139 2.3148 2.1778 2.1950 3.2473 2.4202 3.0400 3.0771 2.4440 3.2043 2.9375 2.7944 1.1485 2.6290 2.7662 2.6943 3.7988 2.6393 2.4608 3.1873 1.7216 2.7331 2.2660 1.9247 2.2484 2.6694 2.1687 2.2745 1.5240 1.6155 2.8107 3.2011 3.1666 1.1028 1.3009 1.5896 1.5855 1.5332 1.8121 1.8786 1.9323 2.4357 1.7558 2.2083 1.8605 1.6274 1.7527 3.6824 1.9251 1.5224 1.3264 1.1325 1.2371 1.2188 2.0471 1.6340 1.8818 3.4992 3.0877 2.9072 2.0800 2.5963 2.4948 2.3472 2.4394 2.4037 1.8275 2.0268 1.4485 1.2892 1.6924 1.5643 1.4128 1.3077 1.2558 1.4024 1.3370 1.2656 1.2663 1.2505 1.2030 1.2572 1.2518 1.0746 1.2712 1.2644 1.2432 1.2836 1.2374 1.2661 1.3484 1.3248 1.3709 1.4651 1.4210 1.3868 1.3923 1.5968 1.8675 1.2105 1.0911 1.1316 1.0881 1.0892 1.0953 1.1000 1.1060 1.0894 1.0781 1.1074 1.0854 1.7568 1.0704 3.2431 6.7037 6.3999 6.4046 6.6022 1.0649 1.0640 1.0588 1.0586 1.0607 1.0585 1.0629 1.0371 1.0593 1.0614 1.0613 1.0976 1.0983 1.1016 1.1001 1.0934 1.1013 1.0943 1.1037 1.1008 1.0924 1.0933 1.0995 1.0963 1.1006 1.0927 1.0937 1.0888 1.0893 1.0885 1.0887 1.0630 1.0830
irintensity: 0.0636 0.4092 0.2835 0.0767 2.1132 2.9850 0.5110 0.8539 1.2740 0.5442 0.3530 0.7402 0.1297 0.9113 0.5568 0.5279 0.9896 0.8102 2.7075 4.2191 4.6123 3.3617 32.2160 1.1980 4.2072 9.6640 7.0565 6.6588 25.0910 5.7103 3.6708 52.1321 3.1886 9.6777 26.1183 13.0887 4.0143 8.0387 0.3195 143.9647 83.3052 0.0965 6.1693 11.9554 3.7709 0.4534 2.0898 0.9271 5.3926 3.6163 3.1484 0.0727 0.6931 7.8406 3.8546 0.0079 12.9539 6.8277 33.5639 7.6655 8.5892 5.3075 71.4100 40.3142 118.4769 2.0197 15.8024 8.8681 47.9493 2.0982 10.2449 8.9274 3.6301 5.7579 1.8574 3.8644 3.9096 6.6493 7.5348 6.4656 11.2726 3.5552 0.1038 1.9260 2.4213 1.4530 1.1318 8.2558 0.1694 1.2459 0.1575 12.1232 0.3615 0.8115 1.0013 0.0965 1.2462 0.9543 1.5505 3.9351 3.4727 2.5254 10.2332 1.6262 66.6322 5.2952 2.0969 3.4606 2.0338 84.0834 13.7729 14.0648 20.4560 6.5098 17.9026 9.2936 10.5098 12.1804 23.8418 0.6211 4.2640 11.3448 54.8822 12.7772 62.1199 0.2542 1.1254 0.5709 0.1623 40.6191 52.5578 27.5581 14.0196 43.9703 50.1415 18.1391 24.7821 71.5325 61.0218 35.5739 8.8528 42.0952 9.1154 15.5441 12.1188 34.5856 4.1286 70.6766 19.1565 1.5752 14.8351 75.0953 31.5908 56.3001 6.9108 8.0552 58.9845 11.3966 34.8984 87.8177 23.9909 60.9181
temp: 298.150 k
press: 1.00000 atm
elementType: 8 8 7 6 6 6 6 6 6 6 6 6 6 6 6 6 6 6 6 6 6 6 6 1 1 1 1 1 1 1 1 1 1 1 1 1 1 1 1 1 1 1 1 1 1 1 1 1 1 1 1 1 1 1 1 1
symmnumber: 1
zpe: 1272117.1 jmol-1
zpe.correction: 0.484524 hartree
zpe.thermalcorrener: 0.512212 hartree
zpe.thermalcorrenthalpy: 0.513157 hartree
zpe.thermalcorrgfe: 0.421290 hartree
zpe.sumelectzpe: -985.188947 hartree
zpe.sumelectthermal: -985.161258 hartree
zpe.sumelectthermalent: -985.160314 hartree
zpe.sumelectthermalfe: -985.252180 hartree
dipole: 0.8279 0.0768 -3.1095
dipole: 3.2187
quadrupole: -142.8495 -144.3990 -135.3014
quadrupole: -2.4619 -1.5140 9.2004
quadrupole: -1.9995 -3.5490 5.5486 -2.4619 -1.5140 9.2004
hfenergy: -985.6734707 hartree
pointgroup: C01 [X(C20H33N1O2)]
dipole: 0.3883769 -0.1341016 1.1978426 debye
polarizability: 264.7399355|-15.6506405|235.431376|-7.8483526|0.3646938|205.6338583 unknown
InChI: InChI=1S/C20H33NO2/c1-2-3-4-5-6-7-8-9-10-11-12-13-14-15-16-17-18-19-20(22)21-23/h6-7,9-10,12-13,15-16,21,23H,2-5,8,11,14,17-19H2,1H3
charge 0 multiplicity 1
56 atoms
O  0.059928 2.902124 -0.603294
O  -2.183307 3.773676 0.48482
N  -1.169797 3.147666 1.292387
C  -4.20172 0.432892 0.249088
C  -3.089696 0.50208 -0.820541
C  -3.744537 -0.237133 1.577615
C  -3.498538 1.31077 -2.071857
C  -3.323793 -1.682767 1.409541
C  -2.366861 1.403287 -3.119744
C  2.365408 2.917858 1.570902
C  3.183263 2.807357 0.252665
C  1.041252 2.10026 1.551393
C  -2.071586 -2.161529 1.631476
C  -1.62158 -3.596511 1.397808
C  3.755449 1.419948 0.039176
C  4.023353 -0.790803 -1.212358
C  3.441265 0.598301 -0.996289
C  -0.632137 -3.665854 0.243527
C  1.672632 -3.973919 -0.801476
C  -0.020957 2.725928 0.667775
C  0.683532 -3.983837 0.355319
C  2.946703 -1.847786 -1.402563
C  2.767334 -2.933633 -0.607953
H  -4.548703 1.461486 0.476296
H  -5.077091 -0.115042 -0.158161
H  -2.793953 -0.52362 -1.11959
H  -2.185111 0.963355 -0.375126
H  -4.578411 -0.175572 2.308075
H  -2.900039 0.344214 2.000693
H  -3.7999 2.331563 -1.756764
H  -4.398204 0.850944 -2.530907
H  -4.104013 -2.377693 1.056425
H  -2.080759 0.397028 -3.481133
H  -1.46412 1.870754 -2.683346
H  -2.674675 2.00127 -3.997899
H  2.14115 3.981868 1.781764
H  2.981837 2.547859 2.414484
H  4.01059 3.544992 0.302709
H  2.538749 3.087938 -0.599206
H  0.653712 1.988809 2.583078
H  1.253363 1.085488 1.163954
H  -1.283464 -1.465256 1.959675
H  -2.507469 -4.225873 1.180107
H  -1.144782 -4.00311 2.312047
H  4.473547 1.067132 0.798859
H  4.664628 -0.769711 -2.121033
H  4.680321 -1.062664 -0.36426
H  2.713437 0.945871 -1.746231
H  -1.032905 -3.382631 -0.742133
H  2.138655 -4.978386 -0.892823
H  1.135161 -3.778579 -1.748482
H  1.090365 -4.245081 1.345559
H  2.263329 -1.691904 -2.252588
H  3.436721 -3.083743 0.254123
H  -1.423363 3.119687 2.277772
H  -1.746911 3.71133 -0.429751
