program: Gaussian 09
title: 000145861
version: EM64L-G09RevD.01
frameworkgroup: C1[X(C8H10N4S)]
method: RPBEPBE
basis: SDD
operation: Freq
keyword: #p
keyword: freq=noraman
keyword: PBEPBE/SDD
title: #p freq=noraman PBEPBE/SDD
converged: NO NO NO NO
title: Mulliken charges:
elementType: S N N N N C C C C C C C C H H H H H H H H H H
charge: 0.187241 -0.166779 -0.028858 0.044330 0.005416 0.341036 -0.092003 -0.337481 -0.230064 -0.613415 -0.557971 -0.397966 -0.663480 0.264464 0.229388 0.258078 0.258073 0.282474 0.282470 0.248177 0.228710 0.228711 0.229450
chargesum: 0.00000
title: Mulliken charges with hydrogens summed into heavy atoms:
elementType: S N N N N C C C C C C C C
charge: 0.187241 -0.166779 -0.028858 0.044330 0.005416 0.341036 -0.092003 -0.337481 0.034400 0.132125 0.006973 -0.149790 0.023391
polarizability: 1.87748177e+02 2.61970704e+00 1.46425121e+02 7.37248147e-03 -5.38083038e-03 6.43449419e+01
1716.lowfreq: -3.0690 -0.0020 -0.0016 0.0013 4.9172 12.5982 33.9886 62.1241 82.0620
frequency: 33.8015 62.1094 82.0532 101.7043 117.5929 192.6788 198.7058 224.1045 240.8759 267.4704 302.1985 302.4966 428.1406 522.0948 540.6732 571.3042 590.4779 604.4559 627.4184 639.8750 726.3422 774.5597 791.5428 794.8125 836.9817 923.3767 926.2966 993.1756 1021.3446 1044.9745 1055.7741 1068.4556 1123.0227 1150.1662 1195.1948 1228.6778 1240.6747 1269.1212 1276.1479 1297.3377 1311.5716 1361.5173 1397.7148 1401.9930 1414.2201 1448.5019 1460.0121 1465.9059 1471.8632 1481.1625 1482.7908 1488.5798 1559.4767 2986.4113 2999.3963 3049.8859 3081.8485 3084.6095 3093.2080 3110.3346 3128.8801 3167.4461 3223.1928
redmass: 3.9024 2.0470 3.6674 3.8681 1.1299 4.7933 4.5317 5.6139 1.1260 3.9582 3.7737 5.1646 8.4535 5.8401 5.4923 7.7881 7.4258 4.5822 4.8494 5.5876 7.2980 1.1148 7.0883 9.6524 1.5236 1.4285 9.7124 1.8137 2.9435 1.2110 2.7336 2.3553 1.3150 6.1428 2.1911 1.2321 2.4719 7.1879 1.3242 5.4028 2.9421 6.0795 1.2071 1.6647 2.6170 1.0849 1.5513 1.0394 1.0396 2.9455 1.0490 1.3910 8.3878 1.0355 1.0333 1.0599 1.0971 1.1013 1.1028 1.1018 1.1080 1.0920 1.0984
irintensity: 0.0659 3.2411 4.3486 3.1934 0.2484 0.0787 0.0280 0.1374 0.0351 2.2173 0.2112 0.9975 6.6912 3.2807 0.8057 11.8989 2.8148 16.8533 1.3772 2.7808 13.1877 8.6201 0.0050 26.6127 17.9725 13.5469 63.1121 24.7418 4.5845 0.4490 12.8887 20.8030 0.5447 12.7929 1.3487 0.5460 73.0288 12.5524 19.8485 72.8516 24.9274 51.4942 22.0467 19.9942 48.1640 13.1844 70.2345 18.7326 16.1619 140.8473 10.9103 48.0618 81.7347 32.4043 28.0905 3.3919 23.1685 15.8461 12.3383 14.0951 19.6463 17.8467 1.0416
temp: 298.150 k
press: 1.00000 atm
elementType: 16 7 7 7 7 6 6 6 6 6 6 6 6 1 1 1 1 1 1 1 1 1 1
symmnumber: 1
zpe: 460913.6 jmol-1
zpe.correction: 0.175553 hartree
zpe.thermalcorrener: 0.188079 hartree
zpe.thermalcorrenthalpy: 0.189024 hartree
zpe.thermalcorrgfe: 0.135467 hartree
zpe.sumelectzpe: -926.955514 hartree
zpe.sumelectthermal: -926.942987 hartree
zpe.sumelectthermalent: -926.942043 hartree
zpe.sumelectthermalfe: -926.995600 hartree
dipole: 3.8280 -5.1525 0.0006
dipole: 6.4189
quadrupole: -88.5100 -77.9340 -84.9827
quadrupole: 15.9233 -0.0002 0.0007
quadrupole: -4.7011 5.8749 -1.1738 15.9233 -0.0002 0.0007
hfenergy: -927.1310668 hartree
pointgroup: C01[X(C8H10N4S1)]
dipole: 1.4761685 -2.0490148 0.0002263 debye
dipolederiv: -0.8364515 0.1904958 -0.0000592 0.3858355 -0.2109996 0.0000194 -0.0001214 0.0000134 -0.1249798 -0.4348821 0.2244499 -0.0000471 -0.0041841 -0.6698564 0.0000888 0.0000118 -0.0000663 -0.1093854 -0.4058409 -0.1946298 0.0000155 0.0438063 -0.7205326 0.0000468 -0.0000098 0.0000013 -0.2604233 -0.4680587 -0.0811696 -0.000014 0.1448092 -0.533884 0.0000245 -0.0000416 0.0000003 -0.2073233 -0.5800649 0.0407334 -0.0000068 0.4501834 -0.8887954 0.0000668 -0.0000216 -0.000003 -0.1508337 -0.8750645 0.2503807 -0.0000546 0.5066892 0.2384371 -0.0000272 -0.000055 -0.0000046 0.1219204 0.6085535 0.4688429 -0.0000471 -0.2128167 0.4486106 -0.0000396 0.0000298 0.0000069 0.07894 1.301084 -0.3818314 0.0001027 -0.7422915 0.6457059 -0.0001026 0.0001377 -0.0000671 -0.0026438 0.4692094 -0.3516701 0.0000416 -0.3390605 0.4833676 -0.0000549 0.0000256 -0.0000161 -0.0582995 0.0981086 -0.1452322 0.0000997 -0.0681399 0.4313124 -0.0001062 -0.0000228 -0.0000779 0.2079294 0.5745658 0.1117566 0.0000381 0.2616036 0.0708182 0.0000368 0.0000167 0.0000361 0.1423974 0.4748469 -0.0514563 0.0000342 -0.1279574 0.6396379 -0.000007 0.0000439 0.0000167 -0.0540242 -0.1638433 0.0586672 -0.0000169 -0.1439855 0.0483222 -0.0000128 -0.000026 0.0000019 0.0732626 0.0917848 -0.0422849 0.0000026 -0.0686182 0.0053842 0.000002 0.0000014 0.0000051 0.1703144 -0.052016 -0.1646651 -0.0001706 -0.0456809 -0.0089448 -0.0000594 -0.0000927 -0.0000886 0.1283709 0.0547025 0.1013835 0.086204 0.0281664 0.0388778 0.0275935 0.0972387 -0.0198168 -0.0262122 0.0549024 0.1013828 -0.0861158 0.0282135 0.0386756 -0.0274573 -0.0971218 0.0200928 -0.0265151 -0.0345229 0.0048877 -0.0215351 -0.0663447 -0.0047314 0.0807248 -0.0310651 0.0697169 -0.016867 -0.0345574 0.0049043 0.0215294 -0.066335 -0.0047377 -0.0807411 0.0310646 -0.0697267 -0.0168708 0.0659312 -0.0447555 -0.0000076 -0.0137626 -0.0833254 0.0000015 -0.0000038 -0.0000161 0.1329796 0.1185227 -0.0081533 0.0136958 0.0753073 0.0138536 0.1110858 -0.0365238 0.1118575 -0.0626212 0.1185206 -0.0081327 -0.0136642 0.0753256 0.01386 -0.1110713 0.0365612 -0.1118571 -0.0626282 -0.1454301 -0.0839039 -0.0000248 -0.1007631 0.0089441 -0.0000113 -0.000026 -0.0000086 0.1235131 unknown
polarizability: 187.8161153|2.012666|146.3571822|0.0072928|-0.0054884|64.3449419 unknown
InChI: InChI=1S/C8H10N4S/c1-3-13-8-6-7(9-4-10-8)11-5-12(6)2/h4-5H,3H2,1-2H3
charge 0 multiplicity 1
23 atoms
S  2.053016 -0.955929 -0.000123
N  -1.353745 -1.488369 -0.000253
N  -3.011425 0.11542 -0.000355
N  -1.509928 2.089751 -0.000453
N  0.881892 1.539499 -0.000315
C  -0.700967 -0.247393 -0.000344
C  -1.753496 0.742738 -0.000383
C  0.64274 0.20239 -0.000368
C  -2.725021 -1.197649 -0.000297
C  -0.753464 -2.831132 -0.000162
C  3.50814 0.264857 0.000002
C  -0.190785 2.404866 -0.000396
C  4.816675 -0.537583 0.00011
H  -3.471453 -1.990782 -0.000269
H  -1.563259 -3.578943 -0.000976
H  -0.127649 -2.980608 -0.89621
H  -0.128964 -2.981127 0.896727
H  3.396292 0.900076 -0.89202
H  3.396154 0.900061 0.892023
H  0.0623 3.469032 -0.000341
H  4.902967 -1.177725 0.89607
H  4.903118 -1.177686 -0.895863
H  5.671161 0.164035 0.000197
