program: Gaussian 09
title: 000145860
version: EM64L-G09RevD.01
frameworkgroup: C1[X(C11H9N3O2)]
method: RPBEPBE
basis: SDD
operation: Freq
keyword: #p
keyword: freq=noraman
keyword: PBEPBE/SDD
title: #p freq=noraman PBEPBE/SDD
converged: YES YES NO NO
title: Mulliken charges:
elementType: O O N N N C C C C C C C C C C C H H H H H H H H H
charge: -0.245832 -0.176446 -0.421778 -0.000469 0.065910 0.347779 -0.288553 0.479331 -0.033485 -0.272461 -0.374998 -0.393487 -0.217653 -0.235875 -0.235893 -0.234143 0.289916 0.186703 0.324795 0.270119 0.239661 0.224825 0.234326 0.232152 0.235556
chargesum: 0.00000
title: Mulliken charges with hydrogens summed into heavy atoms:
elementType: O O N N N C C C C C C C C C C C
charge: -0.245832 -0.176446 -0.096983 -0.000469 0.065910 0.347779 0.001363 0.479331 -0.033485 -0.085758 -0.135337 -0.168661 0.052466 -0.001549 -0.003741 0.001412
polarizability: 3.46183424e+02 -8.01596931e-01 1.62192044e+02 6.04704454e-02 -2.64784000e-01 5.62193946e+01
1716.lowfreq: -3.8779 -0.0006 0.0007 0.0009 4.4692 8.9745 27.8205 46.8642 59.7574
frequency: 27.6204 46.8632 59.7450 70.5984 131.7048 185.6680 187.1732 206.7234 251.6593 291.7606 335.0663 402.0291 411.3885 455.0630 498.4228 541.8065 600.1279 615.5732 624.9109 646.9073 676.0137 693.3826 731.4337 733.3275 771.5805 786.0512 801.8518 845.1540 859.2744 882.0124 901.0823 929.5308 980.6802 985.2990 987.1962 1003.0314 1024.7160 1052.2619 1086.1540 1109.0747 1172.8981 1175.6523 1193.4382 1224.9670 1260.4903 1267.0423 1275.6095 1298.7672 1331.9770 1346.5737 1360.7035 1372.6169 1389.0881 1438.6359 1454.3374 1481.5921 1532.7699 1580.7514 1606.9338 1637.7592 3062.2851 3117.6100 3132.7147 3143.3900 3154.5041 3169.4663 3176.3848 3245.9278 3581.4599
redmass: 4.2122 10.6201 6.5426 5.7607 3.8699 6.3662 5.2590 6.2854 2.4153 8.8674 4.6327 2.7724 8.5837 6.0427 3.0229 6.7516 7.3366 6.4563 5.8083 2.4238 1.6073 1.7299 9.6393 6.2348 1.8777 7.0888 1.4590 1.2960 4.1107 1.7910 7.5568 1.5613 1.3940 1.1432 6.0803 1.2993 2.2545 2.6453 1.6344 2.3569 4.3658 1.1052 1.1296 2.0078 2.2257 3.6444 2.0545 1.7971 1.9596 1.6627 5.6563 4.8756 6.0919 2.5523 3.4379 2.2724 4.6713 5.5463 5.6772 5.4419 1.0892 1.0880 1.0862 1.0912 1.0962 1.1014 1.0896 1.0995 1.0817
irintensity: 2.0282 0.0488 4.1403 0.0014 3.2848 0.6075 2.5100 2.2360 0.0539 0.5588 0.0003 0.0056 0.7027 0.2868 7.5437 1.9675 19.8425 0.7764 27.1698 20.0175 75.4622 48.0608 23.2999 0.0592 63.9444 4.9404 11.3746 0.3007 2.1627 3.3001 9.8671 1.4385 0.4440 56.9491 1.5614 8.4574 3.5400 28.7668 8.8321 18.9704 95.5176 6.4039 12.9214 21.6198 123.3634 65.4864 29.1509 23.8396 58.3697 25.4806 194.0472 30.4478 0.2237 30.8723 40.8305 1.0178 54.0109 11.8715 17.0308 102.3658 31.1116 9.5592 1.6731 9.6010 32.2552 26.8331 21.7074 0.5639 26.3648
temp: 298.150 k
press: 1.00000 atm
elementType: 8 8 7 7 7 6 6 6 6 6 6 6 6 6 6 6 1 1 1 1 1 1 1 1 1
symmnumber: 1
zpe: 482192.3 jmol-1
zpe.correction: 0.183657 hartree
zpe.thermalcorrener: 0.196821 hartree
zpe.thermalcorrenthalpy: 0.197766 hartree
zpe.thermalcorrgfe: 0.141800 hartree
zpe.sumelectzpe: -738.054488 hartree
zpe.sumelectthermal: -738.041323 hartree
zpe.sumelectthermalent: -738.040379 hartree
zpe.sumelectthermalfe: -738.096345 hartree
dipole: 6.4240 -6.5286 -0.0305
dipole: 9.1593
quadrupole: -105.3119 -80.0992 -96.4736
quadrupole: 16.7401 0.1228 -0.1071
quadrupole: -11.3503 13.8624 -2.5120 16.7401 0.1228 -0.1071
hfenergy: -738.2381449 hartree
pointgroup: C01 [X(C11H9N3O2)]
dipole: -2.5198964 2.4998794 0.6213984 debye
dipolederiv: -0.3800597 -0.2192479 -0.0419281 0.1499775 -0.7064909 -0.1006949 0.0346466 -0.0841568 -0.2737144 -1.1053048 0.2185922 0.0813832 0.4608642 -0.5157392 -0.0823777 0.1285734 -0.0720398 -0.2279864 -0.051657 0.0514768 0.0036438 -0.0460416 -0.4934116 -0.05425 -0.0155208 -0.058158 -0.2303934 -0.5046811 0.0954844 0.0327736 -0.6292472 -0.2288913 0.023333 -0.1157889 -0.0077722 -0.2024289 1.4151878 -0.1245035 -0.0729605 -1.2345112 1.4966104 0.3223675 -0.2995483 0.2737485 0.2598727 0.7693058 -0.2695747 -0.0842807 -0.0333739 0.4091228 0.0628682 -0.0369427 0.0734657 0.121987 -0.6869493 0.0560412 0.0347468 0.3568095 -0.0214721 0.0087272 0.1039134 0.0209382 -0.1315617 -0.1711012 0.0149985 0.0123547 -0.1082513 -0.0549533 -0.0174706 -0.0132705 -0.0225707 0.041469 -0.0810303 0.2701549 0.0584382 1.0792859 -0.4472302 -0.1429535 0.2257549 -0.1079549 -0.0135755 0.7672668 -0.0164104 -0.0432927 0.129005 0.2316618 0.0778464 -0.0134153 0.0844639 -0.1332734 -0.0296674 -0.0705611 -0.0207412 0.1142993 -0.0403817 0.0159891 0.0198659 0.0234075 -0.1280743 0.0285366 0.0661388 0.0056106 -0.1382862 0.081982 0.0631534 -0.039673 0.0542828 -0.1629782 -0.148599 -0.0543534 -0.0067163 0.1575097 0.0908622 0.0246902 0.0344758 0.0334808 -0.0576945 -0.2337688 0.0520835 0.0154633 0.1838292 0.1404853 0.0541439 0.0455457 0.0598605 -0.1301707 0.0375354 -0.1190431 -0.0347597 -0.29429 -0.0173087 0.0406487 -0.07351 0.0331357 -0.1315608 0.0004678 0.0409066 0.0016986 -0.0157813 -0.0270977 0.0286848 -0.0109393 0.0260847 -0.1476955 0.129735 -0.013366 -0.0008827 -0.1164977 0.0407345 -0.0228665 -0.0240064 -0.0269905 0.1653403 0.0472264 -0.0283177 -0.001412 -0.08016 -0.1370859 -0.0581079 -0.013461 -0.0601954 0.1331407 0.1190644 0.0519128 0.0198707 0.074402 0.2368231 -0.0227264 0.0245317 -0.0222044 0.3252688 0.0997894 -0.0180567 0.0002832 -0.0214426 0.0200401 -0.0342763 -0.0007722 -0.0344627 0.1842837 0.0112357 0.0938635 0.0272075 0.0697007 0.0375784 -0.0273233 0.0213841 -0.0281979 0.1391416 0.088627 -0.076435 -0.0137262 -0.0277725 -0.0911886 -0.0531209 -0.0030667 -0.0507633 0.1435807 0.0569424 -0.031534 -0.0023634 -0.0833283 -0.0879641 -0.0508216 -0.0136692 -0.0530675 0.1474929 -0.0662725 0.0916169 0.0306405 0.123268 0.008393 -0.0392911 0.0377221 -0.0378585 0.1504897 -0.1118295 -0.0618667 -0.0010515 -0.069967 0.0749216 -0.0161718 -0.0028292 -0.0164758 0.1590407 unknown
polarizability: 345.6515968|1.3610331|157.626755|-12.3376333|21.4732498|61.31651 unknown
InChI: InChI=1S/C11H9N3O2/c15-14(16)11-10(12-8-13-11)7-6-9-4-2-1-3-5-9/h1-8,12H
charge 0 multiplicity 1
25 atoms
O  2.044836 -2.17345 -0.651529
O  4.297693 -1.779551 -0.655604
N  1.877907 1.952527 0.209288
N  3.865898 0.915389 -0.089371
N  3.079704 -1.386435 -0.528808
C  1.544123 0.615159 -0.052175
C  0.202342 0.080504 -0.105788
C  -2.321765 0.277862 0.050479
C  2.819019 0.007406 -0.231673
C  -0.951531 0.800039 0.102449
C  -2.625546 -1.087054 -0.237228
C  -3.404853 1.171974 0.298022
C  3.266898 2.084465 0.17704
C  -3.960263 -1.531482 -0.273944
C  -4.741254 0.725459 0.260985
C  -5.025432 -0.629891 -0.025476
H  0.170956 -0.987468 -0.333712
H  -0.885136 1.875681 0.334595
H  1.208936 2.699979 0.391772
H  3.779974 3.027417 0.348577
H  -1.818067 -1.8006 -0.432477
H  -3.18973 2.224881 0.521085
H  -4.176064 -2.582153 -0.496315
H  -5.558328 1.428899 0.454267
H  -6.062319 -0.981758 -0.05526
