program: Gaussian 09
title: 000145854
version: EM64L-G09RevD.01
frameworkgroup: C1[X(C9H12N4O2)]
method: RPBEPBE
basis: SDD
operation: Freq
keyword: #p
keyword: freq=noraman
keyword: PBEPBE/SDD
title: #p freq=noraman PBEPBE/SDD
converged: YES YES NO NO
title: Mulliken charges:
elementType: O O N N N N C C C C C C C C C H H H H H H H H H H H H
charge: -0.221138 -0.180238 -0.036342 -0.337477 -0.637151 0.153921 -0.541439 0.470283 -0.429072 -0.385705 -0.444200 -0.239251 -0.223801 -0.251730 0.242089 0.237336 0.195048 0.231906 0.190152 0.292181 0.226467 0.231683 0.221077 0.224758 0.342343 0.335953 0.332346
chargesum: 0.00000
title: Mulliken charges with hydrogens summed into heavy atoms:
elementType: O O N N N N C C C C C C C C C
charge: -0.221138 -0.180238 -0.036342 0.004866 0.031148 0.153921 -0.109055 0.470283 -0.007013 -0.093524 -0.217733 -0.007568 -0.002724 -0.026972 0.242089
polarizability: 1.70650140e+02 -6.82837376e+00 1.39172372e+02 -8.41446297e+00 -5.01939383e+00 9.22270182e+01
1716.lowfreq: -9.0464 -7.6999 -0.0003 0.0002 0.0005 1.3848 10.0092 25.6041 30.0101
frequency: 5.7641 25.4051 29.8627 60.7734 72.2416 107.5600 132.9590 215.2875 240.6419 257.7268 303.7829 379.0965 401.5076 406.3822 420.9339 456.8032 473.5410 490.8392 533.7494 562.1792 600.1183 616.8490 632.4027 675.7105 708.5035 721.4521 751.7781 767.1857 818.2738 859.0679 919.6140 925.9925 939.3260 975.7120 980.1319 990.3642 1000.5837 1025.7256 1028.4096 1044.3892 1085.7527 1124.6594 1169.7536 1175.6520 1184.0286 1191.6669 1213.2200 1239.4027 1279.2469 1322.8920 1325.7535 1337.4865 1353.1815 1382.7552 1438.4852 1443.2178 1458.9382 1484.7138 1501.8197 1591.6496 1608.2525 1613.3497 1675.8015 2898.1820 2973.6231 2997.7504 3052.8521 3108.9469 3124.0610 3137.5287 3152.9920 3165.2550 3514.1891 3537.5217 3682.8053
redmass: 5.8818 4.3644 5.1344 5.1913 7.1386 7.2364 3.5604 5.0008 2.9280 4.4596 2.3660 2.5919 2.6344 2.8625 2.1779 2.9753 1.1820 4.1407 1.1888 3.0711 4.7623 6.1377 4.3755 13.2411 1.8330 5.8728 3.4593 1.8629 3.2098 1.2487 1.5551 3.3216 2.2284 3.1699 1.3811 5.3483 1.3485 2.4347 2.3012 2.1337 1.6050 2.9953 1.0903 4.4251 1.2629 1.2133 1.9404 1.1944 2.3588 2.8091 1.5362 1.3403 1.3459 6.3838 1.6878 1.2412 1.1330 2.2961 2.7555 5.9665 1.1852 5.9878 6.9408 1.0627 1.0890 1.0660 1.1020 1.0867 1.0871 1.0927 1.0962 1.0993 1.0777 1.0448 1.1039
irintensity: 4.1513 2.6121 1.8574 1.3986 1.4433 1.7414 3.4941 1.1393 3.9714 7.2754 1.4660 11.3367 4.1736 0.3793 2.4080 26.9468 249.7557 10.9161 197.6142 3.0188 8.7071 1.8519 16.2598 16.9366 57.7665 5.5697 5.5936 48.6919 0.9799 0.9187 11.1849 19.0175 8.6590 20.6721 0.8088 1.3510 1.7118 10.1638 9.7244 3.8671 6.6909 26.8016 13.8249 385.8851 16.2928 21.8334 2.6675 14.6150 63.9386 89.3582 28.5403 4.7212 20.9272 0.3026 11.4268 20.7529 17.8298 18.9519 160.2715 0.6759 79.2874 8.1778 375.7797 54.3131 21.3009 63.1947 18.8503 10.0967 4.7412 36.9544 21.7685 14.0784 52.8413 43.7758 23.5779
temp: 298.150 k
press: 1.00000 atm
elementType: 8 8 7 7 7 7 6 6 6 6 6 6 6 6 6 1 1 1 1 1 1 1 1 1 1 1 1
symmnumber: 1
zpe: 550916.3 jmol-1
zpe.correction: 0.209833 hartree
zpe.thermalcorrener: 0.224390 hartree
zpe.thermalcorrenthalpy: 0.225334 hartree
zpe.thermalcorrgfe: 0.164075 hartree
zpe.sumelectzpe: -718.380774 hartree
zpe.sumelectthermal: -718.366217 hartree
zpe.sumelectthermalent: -718.365273 hartree
zpe.sumelectthermalfe: -718.426532 hartree
dipole: 0.5842 5.5284 3.6670
dipole: 6.6596
quadrupole: -84.8266 -83.6428 -84.9585
quadrupole: 10.0921 7.2370 0.3546
quadrupole: -0.3506 0.8332 -0.4826 10.0921 7.2370 0.3546
hfenergy: -718.5906067 hartree
pointgroup: C01 [X(C9H12N4O2)]
dipole: 0.4265612 2.1827041 1.3851991 debye
polarizability: 168.437579|-8.7462134|139.7400351|-13.6605064|-4.7353596|93.8719164 unknown
InChI: InChI=1S/C9H12N4O2/c10-9(12-13(14)15)11-7-6-8-4-2-1-3-5-8/h1-5,12H,6-7,10H2
charge 0 multiplicity 1
27 atoms
O  3.97408 -1.84363 -0.951776
O  1.783569 -1.772326 -0.264429
N  1.224391 1.188955 -0.666865
N  3.186367 0.050427 0.047228
N  2.336883 1.713016 1.442435
N  2.944127 -1.264325 -0.431881
C  -1.160949 1.692793 -1.21296
C  -1.945536 0.613075 -0.478786
C  0.122739 2.153892 -0.470526
C  -1.397777 -0.683059 -0.284108
C  -3.237806 0.889261 0.038304
C  -2.127941 -1.673293 0.410177
C  -3.97072 -0.101631 0.732462
C  -3.416565 -1.388505 0.92075
C  2.131513 1.022959 0.24483
H  -0.845017 1.336031 -2.211385
H  -1.80875 2.576839 -1.36667
H  0.444971 3.125079 -0.903017
H  -0.126663 2.332145 0.602341
H  -0.398908 -0.912046 -0.669348
H  -3.676556 1.884656 -0.109766
H  -1.68882 -2.667732 0.549992
H  -4.969975 0.128821 1.120201
H  -3.982379 -2.160166 1.455427
H  4.142653 0.34825 -0.172639
H  1.757349 2.518425 1.66866
H  2.87802 1.278687 2.187651
