program: Gaussian 09
title: 000145888
version: EM64L-G09RevD.01
frameworkgroup: C1[X(C11H17NO6S)]
method: RPBEPBE
basis: SDD
operation: Freq
keyword: #p
keyword: freq=noraman
keyword: PBEPBE/SDD
title: #p freq=noraman PBEPBE/SDD
converged: YES YES NO NO
title: Mulliken charges:
elementType: S O O O O O O N C C C C C C C C C C C H H H H H H H H H H H H H H H H H
charge: 1.100931 -0.468306 -0.369059 -0.428566 -0.559414 -0.471762 -0.508829 -0.423464 -0.200546 -0.437246 -0.040537 0.554684 -0.678437 -0.704090 -0.477240 -0.561907 0.338486 0.363794 -0.538503 0.208801 0.229640 0.258002 0.208995 0.282432 0.213100 0.211674 0.270326 0.206900 0.225710 0.224388 0.307090 0.269275 0.370938 0.260452 0.367817 0.394474
chargesum: 0.00000
title: Mulliken charges with hydrogens summed into heavy atoms:
elementType: S O O O O O O N C C C C C C C C C C C
charge: 1.100931 -0.097368 -0.369059 -0.060750 -0.164940 -0.471762 -0.508829 -0.141032 0.008256 0.050396 0.168458 0.554684 0.016662 -0.047092 -0.170150 -0.292632 0.338486 0.363794 -0.278051
polarizability: 2.51045330e+02 2.22892010e+01 2.95131073e+02 9.05418098e+00 -2.16761413e+00 1.32791784e+02
1716.lowfreq: -0.0020 -0.0017 -0.0017 1.0608 4.4106 8.4970 26.0019 29.2194 35.6088
frequency: 25.9624 29.2043 35.3929 45.5340 49.4258 62.2331 84.4069 103.9217 117.5369 139.4964 155.9000 186.7116 212.8504 228.4992 242.2323 244.3416 259.5774 267.2544 288.4940 306.0611 328.4383 330.6517 342.0119 366.6880 377.4563 393.9791 403.3196 440.3958 464.1913 483.9979 492.5971 524.0771 558.0561 582.2575 591.8607 624.4569 652.3109 674.5192 709.6291 804.4553 824.4676 839.1751 854.0009 883.1619 892.3357 918.8171 922.5206 925.2000 930.7773 954.6548 963.0477 973.0114 989.4236 1016.4900 1056.8096 1077.6345 1089.5285 1128.6833 1133.2284 1141.6586 1155.8387 1165.8225 1177.9669 1223.4205 1255.6308 1271.0814 1305.8102 1313.0390 1317.8939 1332.2044 1356.4931 1382.9353 1383.5598 1401.8092 1411.0063 1433.4124 1442.1916 1455.5564 1461.9275 1467.7799 1479.1170 1485.1522 1495.2062 1573.7400 1580.6434 2911.7498 2929.0287 2975.3029 2979.1107 2982.1781 2992.6017 3067.2265 3076.4917 3080.5604 3083.6642 3094.0386 3149.8370 3152.9733 3190.7996 3441.8982 3447.7319 3582.0458
redmass: 6.6368 6.7973 8.4801 4.8352 5.3677 2.8053 4.8302 11.6032 3.6039 5.9564 8.4820 5.6294 1.1820 4.1501 3.9581 1.8896 7.1215 1.2091 6.1713 5.5509 4.5760 3.7105 1.6317 3.7370 2.8451 5.5646 1.1660 2.2305 2.7177 4.8365 6.0951 8.4126 8.9243 3.7746 3.5983 3.5354 2.0727 2.1298 2.1940 2.6551 12.3693 1.6270 2.8500 1.1072 1.8466 1.9555 1.5490 2.3079 2.0181 1.4474 3.9015 5.2095 3.0065 2.4655 3.2650 2.8834 1.1829 1.6376 1.6198 1.9967 2.0434 1.4448 2.0209 1.3064 1.2743 1.2234 1.3244 3.1975 1.2685 1.4508 1.2814 1.3206 4.2263 1.2042 1.3782 4.1376 1.2406 2.3153 1.1668 1.0496 1.0831 1.0722 1.0507 5.1839 6.4381 1.0833 1.0829 1.0368 1.0640 1.0386 1.0634 1.0988 1.0993 1.0978 1.1000 1.0990 1.0925 1.0922 1.0921 1.0653 1.0748 1.0661
irintensity: 0.7883 2.7423 1.8197 1.3871 1.6291 0.3889 5.6228 10.7323 3.9425 1.7435 28.0562 11.2367 0.1846 3.5433 0.0257 2.7267 16.1485 0.9597 3.9789 36.5269 12.3724 0.9371 41.7495 37.7911 3.6514 40.7835 163.9564 4.7173 2.7001 23.5448 10.1088 116.0229 57.8600 7.4420 3.4423 11.3589 42.7611 16.8392 7.8930 2.9291 65.5306 35.3279 10.1226 127.4506 30.2911 35.5453 6.5009 30.6815 12.9311 9.8443 51.6173 14.9576 16.5833 14.1871 4.1415 13.7508 188.5799 70.4987 148.6894 53.1496 34.9346 58.8819 40.8978 13.8065 29.9731 16.5072 7.6950 89.5676 20.6410 40.9320 12.3707 19.0159 5.8973 25.8438 84.4711 83.7060 21.7468 8.3539 6.0654 4.1887 7.6588 3.8751 19.7949 110.6995 27.3165 78.7567 66.0647 40.6058 116.4753 19.0247 205.8300 27.8192 36.0794 19.5896 13.0894 40.3079 3.5340 3.8299 4.1241 77.3447 2.0686 65.7086
temp: 298.150 k
press: 1.00000 atm
elementType: 16 8 8 8 8 8 8 7 6 6 6 6 6 6 6 6 6 6 6 1 1 1 1 1 1 1 1 1 1 1 1 1 1 1 1 1
symmnumber: 1
zpe: 719024.4 jmol-1
zpe.correction: 0.273862 hartree
zpe.thermalcorrener: 0.295555 hartree
zpe.thermalcorrenthalpy: 0.296500 hartree
zpe.thermalcorrgfe: 0.221436 hartree
zpe.sumelectzpe: -1331.839896 hartree
zpe.sumelectthermal: -1331.818202 hartree
zpe.sumelectthermalent: -1331.817258 hartree
zpe.sumelectthermalfe: -1331.892322 hartree
dipole: 3.1226 5.2229 -1.5444
dipole: 6.2781
quadrupole: -100.7558 -130.0178 -126.8724
quadrupole: -17.5837 -7.8437 -10.1292
quadrupole: 18.4595 -10.8025 -7.6571 -17.5837 -7.8437 -10.1292
hfenergy: -1332.1137577 hartree
pointgroup: C01 [X(C11H17N1O6S1)]
dipole: -1.2240672 2.0605342 0.5973136 debye
polarizability: 250.1293214|-22.0363958|295.4926525|11.7234133|3.0705396|133.3462136 unknown
InChI: InChI=1S/C11H16NO3.HO3S/c1-7(2)12-6-11(15)8-3-9(13)5-10(14)4-8;1-4(2)3/h3-5,7,11-13,15H,6H2,1-2H3;1H
charge 0 multiplicity 1
36 atoms
S  2.020706 -2.527271 0.362378
O  -2.099177 0.845102 -1.775999
O  2.592654 -0.763526 -0.846733
O  2.386296 3.679003 1.163994
O  2.216109 -3.505932 -1.179764
O  2.924486 -3.269123 1.476622
O  0.439284 -2.301308 0.678608
N  -3.686367 0.229224 0.166299
C  -1.735772 1.580209 -0.580231
C  -2.434955 0.858386 0.649214
C  -3.995208 -1.160895 0.645042
C  -0.228588 1.571832 -0.393504
C  -3.026134 -2.187228 0.022105
C  -5.458573 -1.478247 0.277175
C  0.507801 0.440141 -0.79807
C  0.438966 2.636646 0.252982
C  1.90829 0.348737 -0.498197
C  1.838233 2.558842 0.529497
C  2.576285 1.416798 0.188702
H  -2.101061 2.629194 -0.642231
H  -2.593824 1.579153 1.475659
H  -1.766285 0.062696 1.018496
H  -3.893327 -1.208642 1.754203
H  -4.502785 0.846273 0.271839
H  -3.273007 -3.201064 0.385966
H  -3.116384 -2.179848 -1.079573
H  -1.96906 -1.999021 0.282596
H  -6.161729 -0.764235 0.748426
H  -5.729285 -2.491855 0.619765
H  -5.598453 -1.434632 -0.818613
H  0.003609 -0.369579 -1.331074
H  -0.096367 3.542963 0.557159
H  -2.954065 0.367267 -1.469502
H  3.644456 1.312466 0.410959
H  3.353878 3.56218 1.336106
H  2.301153 -2.801705 -1.890802
