program: Gaussian 09
title: 000145844
version: EM64L-G09RevD.01
frameworkgroup: C1[X(C10H9NO)]
method: RPBEPBE
basis: SDD
operation: Freq
keyword: #p
keyword: freq=noraman
keyword: PBEPBE/SDD
title: #p freq=noraman PBEPBE/SDD
converged: YES YES NO NO
title: Mulliken charges:
elementType: O N C C C C C C C C C C H H H H H H H H H
charge: -0.413471 -0.022739 0.298753 0.212692 -0.046500 0.116931 -0.379096 -0.791298 -0.300577 -0.442308 -0.253493 -0.232548 0.235414 0.253339 0.191465 0.253471 0.261084 0.257895 0.226111 0.231324 0.343551
chargesum: 0.00000
title: Mulliken charges with hydrogens summed into heavy atoms:
elementType: O N C C C C C C C C C C
charge: -0.069920 -0.022739 0.298753 0.212692 -0.046500 0.116931 -0.143682 -0.093023 -0.039493 -0.184413 -0.027382 -0.001224
polarizability: 1.76978713e+02 6.36757328e+00 1.27468671e+02 -1.75347442e-03 6.06608628e-03 5.12899878e+01
1716.lowfreq: -0.0007 -0.0006 -0.0004 6.8566 7.7093 12.5667 82.4002 115.0136 133.8970
frequency: 82.3098 114.9989 133.8835 216.3810 273.8853 322.1925 336.7958 354.7696 428.3868 433.0062 464.4083 515.3112 525.7290 554.0624 566.6962 657.8493 669.5921 734.1441 768.6296 790.5608 831.6051 874.9283 881.2242 918.5975 964.2145 993.4330 1020.3858 1029.8390 1053.1486 1078.1555 1112.3189 1152.5812 1179.5377 1210.3520 1269.6076 1289.9675 1350.3449 1374.5519 1393.6400 1406.5346 1435.6097 1454.5844 1463.7740 1478.6600 1515.1673 1562.4309 1589.7542 1619.2275 2975.0568 3057.5371 3061.4230 3127.2365 3141.0741 3141.9232 3155.6484 3171.2969 3571.4481
redmass: 1.3189 2.5571 3.0929 3.4274 3.7452 5.3767 3.6630 1.1310 3.2075 7.8915 4.4573 5.7729 3.4815 4.1318 5.6253 3.3606 6.2856 6.0183 1.3374 3.0749 5.0295 1.6349 2.6562 1.4717 1.3671 1.3208 2.3469 1.5131 2.5776 2.0615 1.6755 1.5524 1.3219 2.3072 1.6951 1.9119 3.2372 2.8326 3.2301 1.2806 3.6899 2.7777 1.0430 1.1965 3.3827 7.2551 6.0377 6.3786 1.0371 1.0970 1.0986 1.0851 1.0916 1.0895 1.0955 1.0996 1.0653
irintensity: 2.0756 0.2173 0.9422 0.0308 3.2691 7.9845 5.4221 116.7839 15.3105 5.5342 6.0795 4.7220 1.5474 0.0062 0.1592 0.0044 12.7974 1.5999 92.9371 1.8830 2.6733 0.0471 2.5192 15.0120 3.4232 0.1722 18.2807 3.3981 19.7371 3.1105 205.8901 46.0197 46.5600 0.1290 8.0870 1.3877 7.6423 37.2272 30.1479 5.5303 3.8224 14.1890 15.3668 12.4111 15.5894 13.2513 67.5591 1.1836 33.7967 30.4048 12.9636 0.9349 13.5370 12.2020 25.5608 21.1713 25.1858
temp: 298.150 k
press: 1.00000 atm
elementType: 8 7 6 6 6 6 6 6 6 6 6 6 1 1 1 1 1 1 1 1 1
symmnumber: 1
zpe: 429760.9 jmol-1
zpe.correction: 0.163687 hartree
zpe.thermalcorrener: 0.173520 hartree
zpe.thermalcorrenthalpy: 0.174464 hartree
zpe.thermalcorrgfe: 0.128686 hartree
zpe.sumelectzpe: -515.599398 hartree
zpe.sumelectthermal: -515.589566 hartree
zpe.sumelectthermalent: -515.588622 hartree
zpe.sumelectthermalfe: -515.634400 hartree
dipole: -0.3516 4.2983 0.0015
dipole: 4.3126
quadrupole: -61.0264 -67.1754 -73.9099
quadrupole: -5.7502 -0.0003 0.0023
quadrupole: 6.3441 0.1952 -6.5393 -5.7502 -0.0003 0.0023
hfenergy: -515.7630854 hartree
pointgroup: C01 [X(C10H9N1O1)]
dipole: 0.0862193 -1.6944787 0.0136203 debye
dipolederiv: -1.5613665 0.0217921 -0.0067016 0.2645962 -0.0768717 -0.0010114 -0.0088563 -0.0024336 -0.4079514 -0.1723953 0.1833784 -0.0009337 0.0746469 -0.2833928 0.0007795 -0.0001121 0.001375 -0.2428357 0.1961716 -0.0183268 0.0008911 0.1327787 -0.2013407 0.0025724 -0.0002376 0.0017749 0.0558581 -0.2604316 0.0575138 -0.0012245 -0.2898879 0.2742346 -0.0044799 0.0014399 -0.0032096 -0.0887778 0.084294 0.0432017 -0.0000551 -0.0457123 -0.0757495 0.0005964 0.0005437 0.0011235 0.0339915 1.3769386 -0.0902404 0.0079519 -0.3108308 -0.2481345 0.0009994 0.0098119 0.0023957 0.1270947 -0.1475599 0.0579801 -0.000177 -0.0371705 0.079407 -0.0024026 0.0006134 -0.0017099 -0.1854963 0.0780017 -0.0046216 -0.000414 0.0572152 -0.1230937 0.0016841 -0.001223 0.0019949 0.0646921 0.0693792 0.0322347 0.0008927 -0.0615928 0.1309102 -0.0023335 0.0015482 -0.0018357 -0.1338823 -0.0196219 -0.1107129 0.0010064 0.3403799 0.4199334 -0.0018188 -0.0022255 -0.0043594 -0.0723502 -0.0066898 0.0287692 0.0004892 0.1019462 0.1714721 -0.0017313 -0.000008 -0.0022847 -0.1478768 0.0327849 -0.1178464 0.0019757 -0.1483143 -0.1380961 -0.0011144 0.00223 -0.0008669 -0.1741549 0.0750744 0.0682286 -0.0009269 0.0192429 -0.1057638 0.0020755 -0.0006342 0.0023236 0.1497984 0.0792135 -0.0576685 -0.0832835 -0.0015708 0.0036768 -0.0616702 -0.0388407 -0.0947534 -0.0222077 -0.2190446 0.0826059 -0.0009839 -0.0375138 0.0837122 0.0002843 -0.0004443 0.0004278 0.106045 0.078809 -0.0554627 0.0840685 -0.0006382 0.0055948 0.0613477 0.0391665 0.0940921 -0.0249917 0.0845761 0.0130421 -0.0004864 0.0698338 -0.0469503 0.0019019 -0.0009011 0.0015921 0.1572311 -0.0167046 -0.0876285 -0.0001452 -0.0848982 0.015612 0.0003724 -0.0002425 0.0003258 0.1283754 -0.0340988 -0.1057134 -0.0002587 -0.118775 -0.0200946 0.0006781 -0.0001508 0.0007475 0.1581998 -0.1257536 0.0568057 -0.001997 0.0535758 0.0746264 0.0009505 -0.001967 0.0009738 0.1628649 0.4084238 0.0026688 0.0003122 0.022689 0.060308 0.00232 0.0004894 0.0023065 0.3563737 unknown
polarizability: 177.3195719|4.8378645|127.1200125|0.6687966|-0.5413703|51.297787 unknown
InChI: InChI=1S/C10H9NO/c1-7-8-4-2-3-5-9(8)11-6-10(7)12/h2-6,12H,1H3
charge 0 multiplicity 1
21 atoms
O  3.425585 0.092916 0.038622
N  0.274909 1.938302 0.006731
C  -0.289684 -0.489182 0.021498
C  1.113677 -0.835668 0.031878
C  -0.666671 0.910377 0.009167
C  2.028966 0.229709 0.029354
C  -1.333876 -1.472258 0.023119
C  1.54659 -2.289297 0.045274
C  -2.04834 1.274969 -0.001028
C  1.567316 1.590109 0.016536
C  -2.679076 -1.089212 0.013009
C  -3.043037 0.293114 0.000823
H  -1.078026 -2.537194 0.032601
H  1.163719 -2.82738 -0.841515
H  2.644344 -2.423445 0.046605
H  1.162994 -2.811275 0.9414
H  -2.285793 2.343301 -0.010263
H  2.315343 2.390932 0.01472
H  -3.463363 -1.854583 0.014452
H  -4.100672 0.577722 -0.007057
H  3.695994 -0.858858 0.047273
