program: Gaussian 09
title: 000146130
version: EM64L-G09RevD.01
frameworkgroup: C1[X(C12H21N2O12P3)]
method: RPBEPBE
basis: SDD
operation: Freq
keyword: #p
keyword: freq=noraman
keyword: PBEPBE/SDD
title: #p freq=noraman PBEPBE/SDD
converged: YES YES NO NO
title: Mulliken charges:
elementType: P P P O O O O O O O O O O O O N N C C C C C C C C C C C C H H H H H H H H H H H H H H H H H H H H H
charge: 1.294887 1.178076 1.285296 -0.312444 -0.435279 -0.553062 -0.668877 -0.745274 -0.583340 -0.583952 -0.268601 -0.672034 -0.670294 -0.620349 -0.244306 -0.174705 -0.402838 -0.075655 -0.126871 -0.510659 0.008201 -0.271317 -0.984101 -0.230148 0.203720 -1.029932 0.241824 0.088035 -0.774961 0.270898 0.226917 0.240341 0.297151 0.297080 0.232960 0.247781 0.345249 0.373084 0.321983 0.293667 0.413982 0.344173 0.358246 0.400247 0.411214 0.250708 0.256854 0.225344 0.425597 0.405486
chargesum: 0.00000
title: Mulliken charges with hydrogens summed into heavy atoms:
elementType: P P P O O O O O O O O O O O O N N C C C C C C C C C C C C
charge: 1.294887 1.178076 1.285296 -0.312444 -0.090030 -0.553062 -0.268631 -0.334060 -0.583340 -0.583952 -0.268601 -0.246436 -0.264809 -0.620349 -0.244306 -0.174705 -0.044592 0.195243 0.100047 0.026833 0.305281 0.209424 -0.289034 0.063519 0.203720 -0.271777 0.241824 0.088035 -0.042056
polarizability: 2.52058460e+02 1.52049354e+01 2.79500143e+02 1.92450663e+01 -9.92873662e+00 2.23289956e+02
1716.lowfreq: -31.4569 -10.1849 -8.2122 -4.5956 -0.0015 -0.0015 -0.0014 6.2439 18.7571
frequency: -31.2224 2.7750 18.4473 23.8630 36.9444 41.7196 44.6055 51.3191 61.7113 83.6406 85.4423 106.5021 110.9434 123.8183 124.1846 137.6760 139.7745 153.9073 159.2404 164.8052 173.0760 181.8637 187.3047 201.6864 220.4619 229.1453 243.7513 249.0378 257.2117 276.0602 282.9362 285.3955 295.3734 296.3316 323.9880 329.0730 332.6513 335.8087 344.2053 353.5690 368.9555 374.3545 379.2250 404.1601 422.5761 434.1853 452.6810 467.7689 522.5405 540.1870 590.8180 600.0594 600.3785 621.2159 641.4382 646.2555 665.0681 691.7897 700.3278 714.6179 716.7076 718.0034 738.4782 740.5993 756.1158 758.2346 773.0696 779.2530 818.2618 829.6064 841.6106 859.6644 880.2119 902.2824 924.0387 940.2726 972.5484 980.6450 982.4979 984.6356 1017.1069 1018.3851 1028.4523 1031.7428 1044.7902 1053.7129 1057.2236 1064.3502 1078.5737 1087.6031 1112.5480 1135.6148 1147.3610 1157.4002 1178.6840 1180.9386 1189.6484 1205.8998 1224.3947 1236.8003 1253.0616 1266.9447 1283.1992 1284.6923 1291.8338 1302.8363 1328.0156 1333.6694 1355.7879 1362.0932 1371.2751 1371.9063 1376.3747 1380.1506 1412.3595 1418.5329 1452.5608 1456.9684 1467.4926 1468.6252 1614.9839 1632.1950 1660.3926 2974.9529 2976.7628 2985.3981 2989.9680 3026.5554 3031.6180 3036.8666 3056.6579 3069.2246 3078.6715 3106.9890 3110.9427 3121.0649 3123.1287 3186.2832 3318.5656 3525.1665 3562.3321 3589.0607 3597.3336 3610.8563
redmass: 8.7505 8.2766 9.2432 7.2955 6.8206 6.0323 7.1191 8.6588 7.2348 1.7610 3.0978 5.5297 4.3196 5.5872 2.8961 2.8837 4.8020 3.7965 4.3140 2.4747 8.2768 5.8466 4.8182 3.8117 2.4066 3.8446 3.3186 4.1148 2.3592 3.4056 3.3334 1.3441 2.6939 3.6312 4.4310 5.8907 4.7855 4.1624 3.5511 3.0045 3.2517 4.7012 9.4832 4.7295 3.2010 5.7339 3.7918 4.9321 3.3363 4.7637 6.2743 2.4247 2.0219 4.1140 4.2196 8.2067 6.4036 6.2635 2.5776 4.6168 5.4142 6.1678 5.7133 4.9926 6.7718 6.9280 6.3346 2.1858 3.7556 1.9332 2.9807 1.8665 3.1043 1.3411 3.1533 2.3576 1.5600 1.7856 1.8816 4.6226 1.7528 1.3336 3.9805 3.8572 2.0370 2.2285 1.8909 3.7466 3.6288 2.9090 3.0216 4.7639 1.1301 1.2264 1.1318 1.3642 1.1075 1.1409 3.5673 1.5362 1.7491 1.2090 1.1868 1.2438 1.4103 1.5571 1.3595 1.9776 1.3708 1.7232 1.1312 1.4844 1.5854 1.1559 1.2914 2.3730 1.0458 1.0921 1.0847 1.0881 5.9520 10.1674 6.0146 1.0651 1.0749 1.0655 1.0372 1.0586 1.0884 1.0673 1.1047 1.0969 1.0871 1.0979 1.1003 1.1046 1.1013 1.0931 1.0651 1.0769 1.0664 1.0663 1.0662 1.0664
irintensity: 0.4341 2.6068 0.0475 0.4273 0.4230 0.9739 0.3237 0.8006 1.4870 0.6365 2.3050 0.1051 0.5027 10.1705 6.1226 53.5238 10.4974 23.6810 0.2604 41.9899 6.7488 11.3921 25.1427 7.0125 26.8838 0.9611 7.5609 15.1946 107.0184 11.9381 27.0287 110.6784 22.7524 30.5290 30.6922 39.4550 6.9495 7.6077 54.8527 117.0541 8.3607 13.7176 12.0554 17.4166 19.3946 34.2762 15.8765 1.7473 5.4429 18.1546 28.9345 102.3075 90.9590 66.9936 6.9414 14.8230 56.9179 61.6233 4.4681 26.1270 55.4749 59.3295 35.8123 43.2488 134.6649 88.3952 55.4798 123.7126 5.2725 127.5764 9.1366 88.0972 32.1376 20.5482 54.3693 20.2856 34.3392 5.2766 48.8673 187.1086 28.0952 41.6550 46.9401 161.6004 38.7382 109.7296 56.2835 179.0718 23.9108 23.6638 42.9282 14.8068 27.1008 49.6024 227.5668 13.4458 11.1401 10.2302 14.4777 99.6179 59.4910 52.2557 36.1119 6.7353 2.3399 72.4532 20.3215 53.9230 1.4968 25.3048 26.8117 2.9316 33.1420 5.9230 40.0034 68.9408 20.8133 15.0554 15.5127 3.0145 168.2742 323.1393 531.0642 58.7164 22.0674 55.5190 15.7638 95.8444 6.6744 9.6448 38.5673 15.8336 1.6514 12.7758 4.9052 47.3782 3.1087 2.5939 170.9001 59.3727 9.7556 74.3174 73.9760 85.4641
temp: 298.150 k
press: 1.00000 atm
elementType: 15 15 15 8 8 8 8 8 8 8 8 8 8 8 8 7 7 6 6 6 6 6 6 6 6 6 6 6 6 1 1 1 1 1 1 1 1 1 1 1 1 1 1 1 1 1 1 1 1 1
symmnumber: 1
zpe: 934769.0 jmol-1
zpe.correction: 0.356035 hartree
zpe.thermalcorrener: 0.388881 hartree
zpe.thermalcorrenthalpy: 0.389825 hartree
zpe.thermalcorrgfe: 0.288277 hartree
zpe.sumelectzpe: -2503.498953 hartree
zpe.sumelectthermal: -2503.466107 hartree
zpe.sumelectthermalent: -2503.465162 hartree
zpe.sumelectthermalfe: -2503.566711 hartree
dipole: 3.5984 1.7188 3.3160
dipole: 5.1864
quadrupole: -225.8567 -187.0524 -193.5952
quadrupole: -22.3947 -23.0275 1.6451
quadrupole: -23.6886 15.1157 8.5729 -22.3947 -23.0275 1.6451
hfenergy: -2503.8549879 hartree
pointgroup: C01 [X(C12H21N2O12P3)]
dipole: 1.4361425 -1.367808 -0.4797435 debye
polarizability: 253.377862|-12.8522514|264.640507|-10.7462309|-31.8408941|236.8301901 unknown
InChI: InChI=1S/C12H21N2O12P3/c1-7-3-14(12(17)13-11(7)16)10-2-8(15)9(26-10)4-25-29(23,24)6-27(18,19)5-28(20,21)22/h3,8-10,13,15,18,20-21,23H,2,4-6H2,1H3
charge 0 multiplicity 1
50 atoms
P  2.704169 -0.971513 -1.836941
P  2.642801 1.459048 0.238378
P  2.95956 -0.282549 2.772463
O  -0.836922 -1.173799 0.697541
O  -2.199133 -3.940916 1.262423
O  1.543789 -1.469665 -0.663996
O  1.693513 0.011738 -2.858082
O  3.95439 2.187893 1.205564
O  3.510796 -2.078353 -2.64443
O  1.824143 2.529341 -0.61422
O  -4.649982 0.341175 0.946356
O  3.798454 0.951946 3.633815
O  1.913151 -0.887817 3.989116
O  3.88246 -1.338374 2.010805
O  -3.542354 3.846963 -1.944821
N  -2.565033 0.272379 -0.150695
N  -4.02936 2.084946 -0.495112
C  -0.39107 -2.521492 0.266066
C  -1.688646 -3.340902 0.026489
C  -2.706419 -2.260965 -0.374926
C  -2.294119 -1.041536 0.484498
C  0.467194 -2.416266 -1.000358
C  3.644409 0.191174 -0.735973
C  -1.659002 0.869099 -1.038364
C  -3.810474 0.86893 0.162035
C  1.761455 0.626834 1.665362
C  -1.899709 2.062589 -1.678305
C  -3.174112 2.753704 -1.425397
C  -0.901001 2.71302 -2.601888
H  0.222249 -2.927892 1.090916
H  -1.548539 -4.1132 -0.75786
H  -2.626739 -2.021794 -1.449794
H  -3.733857 -2.584438 -0.1526
H  -2.813974 -1.041507 1.455339
H  -0.114208 -2.029262 -1.859715
H  0.903388 -3.400779 -1.257296
H  -1.537725 -4.578606 1.633141
H  4.17083 -0.437952 0.010067
H  4.369442 0.74535 -1.35424
H  -0.711532 0.341218 -1.161424
H  0.99856 -0.064634 1.268856
H  1.278848 1.42377 2.254121
H  -4.923992 2.541791 -0.290749
H  1.883631 -0.093396 -3.825526
H  4.316006 3.027961 0.827513
H  -0.636363 3.719635 -2.23251
H  0.025504 2.120371 -2.666856
H  -1.333974 2.848428 -3.610296
H  4.169506 1.6207 2.978178
H  2.367892 -1.244398 4.794032
