program: Gaussian 09
title: 000145842
version: EM64L-G09RevD.01
frameworkgroup: C1[X(C8H10O4S)]
method: RPBEPBE
basis: SDD
operation: Freq
keyword: #p
keyword: freq=noraman
keyword: PBEPBE/SDD
title: #p freq=noraman PBEPBE/SDD
converged: YES YES NO NO
title: Mulliken charges:
elementType: S O O O O C C C C C C C C H H H H H H H H H H
charge: 0.984345 -0.395526 -0.255814 -0.514964 -0.514303 -0.077286 -0.226621 -0.204749 0.344756 -0.321680 -0.323285 -0.483667 -0.537920 0.281450 0.284408 0.255521 0.266740 0.241303 0.244543 0.242568 0.228481 0.253469 0.228231
chargesum: 0.00000
title: Mulliken charges with hydrogens summed into heavy atoms:
elementType: S O O O O C C C C C C C C
charge: 0.984345 -0.395526 -0.255814 -0.514964 -0.514303 -0.077286 0.054829 0.079659 0.344756 -0.066160 -0.056546 0.244748 0.172261
polarizability: 1.93793058e+02 2.12839133e+00 1.16630133e+02 -1.85868293e-01 2.04600923e+00 8.31727379e+01
1716.lowfreq: -0.0020 -0.0017 -0.0010 3.8753 5.2123 6.5818 22.9127 46.3520 56.1939
frequency: 22.8843 46.3228 56.1822 101.3178 115.0364 126.0385 151.7191 205.2171 210.4619 235.9198 238.7276 272.2844 326.6207 359.7948 363.3799 418.1555 440.7428 481.5285 498.5712 535.2013 596.9223 617.4352 717.3916 763.2059 818.0878 828.7580 841.2533 924.0844 953.8705 956.0171 973.6860 979.5516 986.0756 1054.2414 1108.3236 1110.1578 1112.1593 1112.7584 1156.3769 1175.5695 1238.3086 1291.1335 1387.5420 1406.8551 1416.2512 1435.8196 1440.3129 1468.4847 1470.4029 1474.9610 1476.2528 1586.1938 1601.0907 2969.3130 2972.7478 3062.0485 3078.4735 3102.0510 3135.5952 3157.1818 3161.1047 3177.9725 3182.2468
redmass: 3.2255 4.5530 4.4641 3.8274 2.9935 1.3473 4.4516 3.6533 2.8782 7.0859 1.5319 5.5523 6.4451 7.8595 7.6122 2.9716 5.6506 5.4667 5.1744 3.8848 6.9677 7.0964 3.4238 5.8221 1.2816 13.4702 1.6218 9.0038 4.4027 1.7203 1.3674 8.6608 4.2997 2.5537 1.3429 1.2620 1.2769 1.2833 1.3188 1.1862 3.7214 1.2618 5.4835 1.1214 4.3320 1.1927 1.0488 1.2469 1.0678 1.0690 1.6217 6.9547 6.6213 1.0327 1.0281 1.1045 1.1059 1.1026 1.1000 1.0892 1.0893 1.0954 1.0973
irintensity: 4.5185 2.3087 0.6807 0.4888 2.3182 0.6571 17.0983 9.8487 2.1383 1.1524 1.4588 9.6942 1.1581 3.7624 5.8703 0.1139 27.7981 18.8954 103.8998 121.5843 26.3209 1.0477 0.2138 11.4421 12.7884 110.8768 55.3335 85.1275 63.1642 17.2068 0.9372 45.0056 5.3445 40.2176 17.3384 1.6556 3.5151 5.2161 6.3567 72.1884 222.8381 2.8751 10.2300 0.6665 6.1556 18.7482 15.2974 100.5305 21.9660 24.4594 16.1336 52.8613 96.2482 59.2225 44.0576 39.7244 24.3348 10.6622 19.3957 1.4629 0.8938 5.8082 5.9060
temp: 298.150 k
press: 1.00000 atm
elementType: 16 8 8 8 8 6 6 6 6 6 6 6 6 1 1 1 1 1 1 1 1 1 1
symmnumber: 1
zpe: 440730.4 jmol-1
zpe.correction: 0.167865 hartree
zpe.thermalcorrener: 0.182123 hartree
zpe.thermalcorrenthalpy: 0.183067 hartree
zpe.thermalcorrgfe: 0.125258 hartree
zpe.sumelectzpe: -1008.619536 hartree
zpe.sumelectthermal: -1008.605279 hartree
zpe.sumelectthermalent: -1008.604334 hartree
zpe.sumelectthermalfe: -1008.662143 hartree
dipole: -4.8409 -1.4711 2.4569
dipole: 5.6245
quadrupole: -66.6332 -82.4250 -89.6367
quadrupole: 6.8074 10.0551 -0.4105
quadrupole: 12.9318 -2.8600 -10.0718 6.8074 10.0551 -0.4105
hfenergy: -1008.7874014 hartree
pointgroup: C01 [X(C8H10O4S1)]
dipole: -1.8780974 0.6383166 -0.9807987 debye
dipolederiv: 2.2093786 0.0089437 0.0016036 0.086405 1.1833616 -0.0336825 -0.318249 -0.0496087 1.5636296 -1.0025316 -0.0285764 0.1563374 -0.0537039 -0.4391107 0.0307428 0.3259458 0.0355223 -0.6988673 -1.9106482 0.2645614 -0.1429288 0.1226971 -0.332856 0.0109517 -0.2024903 0.0311152 -0.3145482 -0.7117616 -0.0384857 -0.0363356 -0.066875 -0.5748119 -0.1561366 0.0395092 -0.0474955 -0.5755949 -0.7206565 0.0480442 -0.044488 0.0409908 -0.6032232 0.1442935 0.0471047 0.0449357 -0.5391681 -0.3598025 0.0477197 -0.0255012 0.0049787 -0.2234273 -0.0040076 -0.145663 0.0043534 -0.2174806 0.1580095 -0.022838 0.0330475 -0.3152929 0.0450833 -0.0113184 0.014522 0.0237364 -0.0633792 0.1125975 -0.0356724 0.0305568 0.33142 0.0546765 0.0426031 0.0831491 -0.0052479 -0.0704945 1.762137 -0.1011504 0.1730359 0.2135831 0.0977123 0.0190377 0.2457758 -0.0175825 0.1535176 -0.4805808 -0.0388913 -0.0238517 -0.3566642 -0.0377102 -0.0232501 -0.0721331 0.0108538 -0.1941167 -0.4898296 0.096966 -0.0152848 0.2774658 0.0100757 0.0503277 -0.0048461 0.0334973 -0.1527184 0.6351052 0.0351317 -0.2290785 -0.002039 0.2453104 0.0087636 0.193335 0.0229572 0.0578539 0.6859224 -0.1671019 0.0189931 -0.5387491 0.4007564 -0.048176 -0.0077444 -0.0126996 0.3114115 0.1220318 -0.0568993 -0.021209 -0.0358084 0.0617188 -0.0093995 -0.0084966 -0.025262 0.145419 0.1123969 0.0710174 -0.0078873 0.040615 0.0713873 -0.0097729 -0.0032046 0.0082821 0.1503878 -0.0029186 0.0795916 -0.0102999 0.0872621 -0.0019939 -0.0098313 -0.0195192 -0.009615 0.1690568 0.0336809 -0.0586587 -0.0220524 -0.0508708 0.0111851 -0.0230164 -0.0309676 -0.0251101 0.1689771 -0.0422983 -0.043855 0.0423208 -0.0933422 -0.0494995 -0.0670109 -0.1000262 -0.1009652 0.083772 -0.0297147 -0.0134867 0.0858573 -0.010335 0.1371734 0.0228623 0.0303251 0.0197525 -0.065014 -0.0492302 0.0358562 0.0455574 0.1098397 -0.0633183 0.0409194 -0.0877595 0.0655891 0.1104065 0.0575774 -0.0078853 -0.0522149 0.1527256 -0.0125709 -0.0712498 0.0317853 -0.0983822 -0.1035561 -0.1289216 -0.0242545 -0.0346337 -0.0716455 0.0766123 -0.0151014 -0.042549 -0.0090564 0.1216357 0.0400571 -0.0500763 0.0784562 0.127343 -0.056531 0.1114519 0.0321967 0.1004302 -0.0411295 unknown
polarizability: 193.6670764|-3.4197247|116.5625619|2.0552525|3.0000272|83.3662914 unknown
InChI: InChI=1S/C8H10O4S/c1-11-7-3-5-8(6-4-7)13(9,10)12-2/h3-6H,1-2H3
charge 0 multiplicity 1
23 atoms
S  2.217118 0.016523 0.56091
O  2.720012 0.205226 -1.23547
O  -3.731127 -0.365551 -0.307507
O  2.608042 1.384282 1.341469
O  2.767406 -1.415108 1.08962
C  0.383145 -0.06348 0.276946
C  -0.348165 1.133126 0.310175
C  -0.204165 -1.325525 0.059416
C  -2.364262 -0.187305 -0.105211
C  -1.744713 1.071292 0.119704
C  -1.593957 -1.382132 -0.130227
C  4.188177 0.27371 -1.389201
C  -4.593641 0.823041 -0.288408
H  0.156349 2.0863 0.497232
H  0.408701 -2.231976 0.057694
H  -2.328702 1.994961 0.14639
H  -2.105933 -2.333054 -0.300615
H  4.605983 1.15363 -0.866533
H  4.334322 0.380575 -2.477242
H  4.672076 -0.654896 -1.035011
H  -4.55208 1.330063 0.694307
H  -5.608244 0.439876 -0.466934
H  -4.313942 1.531522 -1.091103
