program: Gaussian 09
title: 000145834
version: EM64L-G09RevD.01
frameworkgroup: C1[X(C7H8N2O5)]
method: RPBEPBE
basis: SDD
operation: Freq
keyword: #pfreq=noraman
keyword: PBEPBE/SDD
title: #p freq=noraman PBEPBE/SDD
converged: NO YES NO NO
title: Mulliken charges:
elementType: O O O O O N N C C C C C C C H H H H H H H H
charge: -0.230327 -0.278184 -0.234208 -0.212097 -0.284905 0.047799 -0.615535 0.224607 0.173584 -0.369942 0.273118 0.196830 -0.216446 -0.671694 0.315335 0.231951 0.231945 0.214878 0.232058 0.232058 0.349962 0.389213
chargesum: 0.00000
title: Mulliken charges with hydrogens summed into heavy atoms:
elementType: O O O O O N N C C C C C C C
charge: -0.230327 -0.278184 -0.234208 -0.212097 -0.284905 0.047799 0.123639 0.224607 0.173584 -0.054607 0.273118 0.196830 0.247450 0.007300
polarizability: 1.86692500e+02 7.09980190e+00 1.32362796e+02 -2.05824376e-02 -2.81476287e-03 5.28184724e+01
1716.lowfreq: -13.5344 -7.0800 -1.5296 0.0003 0.0007 0.0009 28.4558 66.5711 68.9095
frequency: 28.4412 66.5439 68.9061 69.8609 110.1659 139.9786 182.4046 214.5337 233.3850 243.2190 288.6008 304.7817 326.0000 355.5625 437.2712 492.5816 497.9695 563.3913 577.0294 638.0360 681.5761 691.1064 701.0784 727.2048 746.9304 793.6432 799.2018 830.1797 884.1331 884.4738 983.2190 1019.2884 1043.9921 1105.2001 1115.2017 1134.6456 1171.6877 1212.0613 1248.8448 1256.6598 1343.2725 1356.0168 1365.6771 1400.6751 1456.3470 1462.1140 1474.2699 1486.3803 1535.3719 1555.5514 1643.9451 1664.4624 2999.4546 3012.1842 3071.4913 3096.3634 3111.3754 3261.3458 3436.5109 3651.5135
redmass: 2.8425 2.9992 9.4243 5.0073 6.8880 3.6996 6.1972 5.1093 4.8188 1.3572 5.4951 6.2140 6.6910 3.7013 7.1558 8.7751 1.1411 5.9049 4.5128 6.5729 1.5411 8.9933 7.3140 3.4719 10.2615 4.8561 1.0993 3.9490 1.3690 6.9999 2.6165 2.5773 4.4097 2.7477 2.3997 1.4597 1.7951 8.8864 1.1348 7.0789 7.1645 1.6809 4.1253 1.2667 6.6407 1.0402 1.0648 1.0716 1.2417 8.1975 11.3082 6.3677 1.0359 1.0580 1.1069 1.0986 1.1026 1.0997 1.0516 1.0983
irintensity: 1.1282 1.4387 1.8451 1.9260 2.5820 3.3654 13.8801 3.1014 3.2943 0.0288 4.8975 7.2880 5.1317 5.8992 2.7505 0.4064 148.7705 0.0071 5.2017 6.2792 88.6127 13.7272 34.2766 79.6653 0.2320 7.0304 3.4498 3.6830 23.6095 5.3293 14.5186 0.9301 372.4610 163.7013 37.7398 5.7856 158.1048 383.1488 0.0040 59.6835 53.2920 66.9869 93.5853 24.4822 192.9281 12.7051 8.0240 6.8969 10.8358 90.2621 381.1790 537.0253 19.1350 20.9438 8.4706 28.5371 42.4187 11.8720 118.3025 119.5357
temp: 298.150 k
press: 1.00000 atm
elementType: 8 8 8 8 8 7 7 6 6 6 6 6 6 6 1 1 1 1 1 1 1 1
symmnumber: 1
zpe: 408245.5 jmol-1
zpe.correction: 0.155492 hartree
zpe.thermalcorrener: 0.169119 hartree
zpe.thermalcorrenthalpy: 0.170063 hartree
zpe.thermalcorrgfe: 0.113729 hartree
zpe.sumelectzpe: -756.033609 hartree
zpe.sumelectthermal: -756.019983 hartree
zpe.sumelectthermalent: -756.019038 hartree
zpe.sumelectthermalfe: -756.075372 hartree
dipole: -1.8696 -2.2204 0.0012
dipole: 2.9027
quadrupole: -75.2772 -85.7199 -79.6771
quadrupole: -25.9638 0.0045 0.0047
quadrupole: 4.9475 -5.4952 0.5477 -25.9638 0.0045 0.0047
hfenergy: -756.1891018 hartree
pointgroup: C01 [X(C7H8N2O5)]
dipole: -0.7735925 0.8400809 -0.0004676 debye
dipolederiv: -0.6574612 -0.1577252 -0.0001069 0.0403997 -0.3428739 -0.0000066 -0.0001495 -0.0000331 -0.1366523 -1.6219128 -0.437159 -0.0000357 -0.9582551 -0.8465015 -0.0000868 0.0002027 0.0001038 -0.2846801 -0.8779385 0.272368 -0.0001058 0.2086566 -0.9234675 0.0001339 0.0000401 -0.0001437 -0.3148924 -0.4169951 -0.0087081 -0.0000815 0.2686141 -1.0628135 -0.0001089 -0.0001699 0.0003173 -0.2366719 -1.0959783 0.0439336 -0.0000752 -0.2613184 -0.429862 -0.0000138 -0.0005307 0.000002 -0.2888763 1.6914379 -0.505588 0.0003431 -0.532836 1.5467382 -0.0000228 0.0006993 -0.0003309 0.2155858 -0.863625 -0.6773817 -0.0000264 -0.6041288 -0.9467049 -0.0000513 -0.0000585 -0.0000848 -0.6253264 -0.988762 0.3352172 -0.0001159 0.8360853 0.128011 0.0001497 -0.0000922 0.0000408 -0.0108967 -0.952094 0.5035719 -0.0002158 0.0142057 -0.8408896 0.0000386 -0.0001375 0.0000316 -0.0470523 0.8321587 -0.0960926 0.0001695 -0.1939321 -0.0681693 -0.00003 0.0001188 -0.0000378 -0.075413 0.9329273 0.6228946 0.0001154 0.4946317 1.3245654 0.000062 0.000188 0.0001396 0.2708116 2.4275216 -0.1348739 0.0002432 0.3972215 1.4175485 -0.0000597 0.0000726 0.0000365 0.2611484 1.092719 0.2501631 -0.0000064 0.1832963 0.2993103 -0.0000011 -0.0000783 -0.0000262 0.3561509 -0.0631381 -0.0907527 -0.0000023 -0.0673209 -0.0720989 0.0000132 0.0000103 0.0000137 0.0588513 0.1394897 0.0070376 -0.0000144 -0.053905 0.1125058 -0.0000088 -0.0000298 0.0000111 0.1869921 -0.0795695 -0.0422527 0.0137538 0.031806 0.0027289 -0.0921059 0.0529719 -0.0851909 -0.0575526 -0.0795901 -0.0422263 -0.0137753 0.0318345 0.0027383 0.092102 -0.0529836 0.0852002 -0.0575509 -0.1808354 -0.0180592 0.0000252 -0.0086345 0.074111 -0.0000034 0.0000355 0.0000033 0.1181995 0.1121194 0.0586281 0.0731027 0.0022344 0.0194195 -0.0790592 0.0493218 -0.0976279 -0.060738 0.1120922 0.0586468 -0.0731326 0.0022513 0.019429 0.0790543 -0.0493638 0.0976088 -0.060716 0.2074818 0.0251713 -0.0000306 0.0910244 0.32177 -0.0000004 -0.0000415 0.0000013 0.4063175 0.3299522 0.0331871 -0.0000282 0.0780692 0.2645052 0.000005 -0.0000256 -0.0000346 0.3829616 unknown
polarizability: 187.2149839|-4.6634545|131.8403117|0.0206871|-0.0018987|52.8184724 unknown
InChI: InChI=1S/C7H8N2O5/c1-2-13-7(10)5-3-4(9(11)12)6(8)14-5/h3H,2,8H2,1H3
charge 0 multiplicity 1
22 atoms
O  0.393099 1.613636 -0.00042
O  -2.612118 -0.485687 -0.000767
O  -2.451398 1.858327 -0.000607
O  2.709208 -2.37923 0.000193
O  3.995427 -0.472541 0.000574
N  2.832821 -1.093722 -0.000225
N  2.725823 1.99775 0.000007
C  -0.472178 0.456099 -0.00067
C  1.668102 -0.283396 -0.000338
C  0.29284 -0.695561 -0.000574
C  1.689334 1.134191 -0.00022
C  -1.910777 0.726193 -0.000906
C  -4.103414 -0.367768 -0.000592
C  -4.654634 -1.7888 -0.000497
H  -0.081127 -1.715395 -0.000706
H  -4.404893 0.205347 0.894651
H  -4.405097 0.205308 -0.89579
H  -5.759214 -1.759466 -0.000374
H  -4.32252 -2.341487 -0.895445
H  -4.32232 -2.341449 0.894403
H  2.577492 3.005039 0.000063
H  3.658742 1.567812 0.000141
