program: Gaussian 09
title: 000145832
version: EM64L-G09RevD.01
frameworkgroup: C1[X(C5H6O2)]
method: RPBEPBE
basis: SDD
operation: Freq
keyword: #p
keyword: freq=noraman
keyword: PBEPBE/SDD
title: #p freq=noraman PBEPBE/SDD
converged: NO NO NO NO
title: Mulliken charges:
elementType: O O C C C C C H H H H H H
charge: -0.219056 -0.212198 0.392770 -0.396001 -0.465216 -0.782545 0.196265 0.239700 0.239697 0.281123 0.248433 0.238509 0.238519
chargesum: 0.00000
title: Mulliken charges with hydrogens summed into heavy atoms:
elementType: O O C C C C C
charge: -0.219056 -0.212198 0.392770 0.083396 -0.184093 -0.057083 0.196265
polarizability: 8.13778094e+01 1.09166684e+01 5.78235908e+01 1.41273044e-03 1.36523342e-03 3.42542731e+01
1716.lowfreq: -1.3207 -0.0002 0.0004 0.0006 9.6530 13.8738 111.1332 175.8810 221.9865
frequency: 111.1314 175.8563 221.9677 277.9235 427.5340 475.0296 565.5157 661.0226 675.9175 812.7957 858.2243 882.3252 944.1550 953.5127 1003.5461 1054.9231 1086.9341 1133.6626 1175.2700 1279.1405 1317.9679 1400.0950 1447.4858 1459.3536 1462.3747 1652.9843 1697.3924 2972.5662 2997.1729 3043.7139 3051.5917 3100.2354 3213.1933
redmass: 1.1059 3.4834 2.9812 2.9858 2.2378 5.3788 5.3670 7.5929 4.2998 6.0189 1.4804 3.0179 5.5668 1.3675 1.7675 1.6269 4.2898 1.1304 1.7212 1.5692 2.5092 1.2501 1.0846 1.0451 1.0729 6.7694 12.0372 1.0387 1.0571 1.0973 1.1046 1.0983 1.0991
irintensity: 0.0545 0.8079 4.1997 0.9751 16.8424 2.2951 1.1905 0.0472 1.9202 64.6564 26.2625 2.1204 43.9768 14.6341 1.8010 4.0013 75.1438 0.0073 4.6332 7.4905 9.4172 18.9406 8.8368 19.1608 20.2604 24.8674 424.3597 13.1595 29.0885 6.0343 20.7445 15.0942 1.1923
temp: 298.150 k
press: 1.00000 atm
elementType: 8 8 6 6 6 6 6 1 1 1 1 1 1
symmnumber: 1
zpe: 260741.1 jmol-1
zpe.correction: 0.099311 hartree
zpe.thermalcorrener: 0.105862 hartree
zpe.thermalcorrenthalpy: 0.106806 hartree
zpe.thermalcorrgfe: 0.068809 hartree
zpe.sumelectzpe: -344.040500 hartree
zpe.sumelectthermal: -344.033950 hartree
zpe.sumelectthermalent: -344.033006 hartree
zpe.sumelectthermalfe: -344.071002 hartree
dipole: 6.4143 0.0545 -0.0007
dipole: 6.4146
quadrupole: -47.8257 -38.9047 -40.4595
quadrupole: 0.5499 0.0023 0.0001
quadrupole: -5.4291 3.4920 1.9371 0.5499 0.0023 0.0001
hfenergy: -344.1398115 hartree
pointgroup: C01[X(C5H6O2)]
dipole: 2.5236442 -0.0133414 -0.0002678 debye
dipolederiv: -0.6287219 -0.1188074 -0.0000532 -0.2489223 -0.8944423 0.0000855 -0.0003369 -0.0003921 -0.2962076 -1.2154565 -0.331875 -0.00044 -0.1566187 -0.5420019 -0.0001328 0.0004174 0.0002144 -0.3410728 0.5239788 0.0134772 0.0000175 0.2199935 0.2232686 0.0000898 -0.0000284 0.0001246 -0.09919 0.3193445 0.1540606 -0.0000063 -0.0272738 0.025252 -0.0001532 -0.0000491 -0.0001351 0.3491936 -0.7666351 -0.0054384 0.0000082 0.0242954 -0.0524942 -0.0000858 -0.0001987 0.0000841 -0.1797509 -0.2042609 0.0559834 0.0000113 -0.0170812 0.0224659 0.0000251 0.0000641 -0.0000516 0.0627529 1.7562687 0.3510929 0.0004951 0.2197651 1.1143981 0.000119 0.0002859 0.0000722 0.2746831 0.0126467 -0.0515524 -0.0483316 -0.046107 0.045782 -0.0601027 -0.0748855 -0.1068209 -0.0211151 0.0126195 -0.0515975 0.0483397 -0.0461476 0.0456839 0.0601615 0.0749339 0.1068964 -0.0211059 0.0992435 0.0213763 -0.0000399 0.0340894 -0.0199804 0.0000118 -0.0001099 0.0000112 0.1987145 0.052821 -0.0004176 -0.000003 0.0795642 -0.1074418 -0.0000082 -0.000019 -0.0000068 0.1215259 0.0190691 -0.0181577 -0.0543328 -0.0177828 0.0697586 -0.0953689 -0.108667 -0.0761438 -0.0242466 0.0190827 -0.0181445 0.0543349 -0.0177742 0.0697516 0.0953588 0.1085933 0.0761475 -0.024181 unknown
polarizability: 81.6741467|10.5880045|57.5272535|0.0014314|0.0013456|34.2542731 unknown
InChI: InChI=1S/C5H6O2/c1-4-2-5(6)7-3-4/h2H,3H2,1H3
charge 0 multiplicity 1
13 atoms
O  -0.86369 1.176149 0.000176
O  -2.414977 -0.582639 0.000091
C  1.116999 -0.169799 0.000056
C  0.613589 1.267939 0.000242
C  0.03619 -1.000375 0.000005
C  2.580209 -0.502413 0.000131
C  -1.226933 -0.215757 -0.000704
H  0.926778 1.829391 0.900943
H  0.92682 1.829701 -0.900233
H  0.029785 -2.090329 0.000132
H  2.749399 -1.591418 0.000093
H  3.084851 -0.073663 0.88789
H  3.084978 -0.073586 -0.887522
