program: Gaussian 09
title: 000145813
version: EM64L-G09RevD.01
frameworkgroup: C1[X(C4H4N2O2)]
method: RPBEPBE
basis: SDD
operation: Freq
keyword: #pfreq=noraman
keyword: PBEPBE/SDD
title: #p freq=noraman PBEPBE/SDD
converged: NO NO NO NO
title: Mulliken charges:
elementType: O O N N C C C C H H H H
charge: -0.219937 -0.230836 -0.318440 0.036142 0.328081 -0.277205 -0.327257 -0.174488 0.302011 0.286743 0.331000 0.264186
chargesum: 0.00000
title: Mulliken charges with hydrogens summed into heavy atoms:
elementType: O O N N C C C C
charge: -0.219937 -0.230836 0.012559 0.036142 0.328081 0.024806 -0.040513 0.089698
polarizability: 9.05507361e+01 8.08021235e-01 7.29453916e+01 1.92210468e-03 2.62043143e-04 2.53289234e+01
1716.lowfreq: -14.7349 -4.7538 -4.5475 -0.0010 -0.0009 -0.0004 91.9959 205.1020 212.8542
frequency: 91.6014 205.0966 212.8391 419.7060 516.0941 585.6591 602.8295 638.5607 704.2947 722.5624 737.6543 828.3286 877.2125 881.6138 939.7350 1023.4793 1080.1284 1146.8078 1180.2200 1243.2312 1313.8814 1347.9288 1411.0895 1426.1739 1486.7104 1546.5691 3237.8022 3260.0507 3265.1408 3600.3224
redmass: 6.3094 5.9968 6.0977 9.4038 7.2915 3.4950 3.6018 1.1852 4.5463 1.2733 12.4482 1.5078 5.0594 1.3461 4.3320 1.5867 1.3703 1.3840 5.5625 1.6394 4.2744 10.8012 3.0441 5.9327 3.9902 3.7074 1.0925 1.1020 1.1060 1.0820
irintensity: 0.5732 0.2795 0.4296 2.2572 0.0015 22.1182 20.4254 85.1369 24.0161 70.6448 21.8425 43.5745 0.7697 10.8515 12.0845 31.0653 25.4725 5.7007 113.7675 30.4712 158.9680 131.6032 30.6848 14.0909 44.6118 31.3140 0.7808 6.5282 4.6901 80.7720
temp: 298.150 k
press: 1.00000 atm
elementType: 8 8 7 7 6 6 6 6 1 1 1 1
symmnumber: 1
zpe: 218517.8 jmol-1
zpe.correction: 0.083229 hartree
zpe.thermalcorrener: 0.089579 hartree
zpe.thermalcorrenthalpy: 0.090523 hartree
zpe.thermalcorrgfe: 0.052352 hartree
zpe.sumelectzpe: -414.100786 hartree
zpe.sumelectthermal: -414.094436 hartree
zpe.sumelectthermalent: -414.093491 hartree
zpe.sumelectthermalfe: -414.131662 hartree
dipole: -7.1698 -1.2019 -0.0031
dipole: 7.2698
quadrupole: -43.7662 -42.1661 -47.4319
quadrupole: 3.1863 -0.0136 -0.0004
quadrupole: 0.6885 2.2886 -2.9771 3.1863 -0.0136 -0.0004
hfenergy: -414.1840146 hartree
pointgroup: C01 [X(C4H4N2O2)]
dipole: 2.8121787 0.5217121 -0.0017388 debye
dipolederiv: -0.6556565 -0.2058459 -0.0000954 -0.2159967 -0.7287867 -0.0006196 0.0005512 0.001125 -0.2479508 -0.7120655 0.1849225 -0.0001575 0.2700353 -0.6947767 0.0007348 0.0007109 -0.0010042 -0.2523611 -0.7219308 -0.2471202 0.0001512 -0.0158778 -0.1526424 -0.0000944 -0.0000735 -0.0000118 -0.235538 1.7930972 0.0703743 -0.0002819 0.0068463 1.1629575 -0.0001195 -0.0000077 -0.0000659 0.2210922 -0.8319534 -0.1228704 0.0003931 -0.2544187 0.0228271 -0.0000194 -0.0007248 -0.0000324 -0.0032802 0.6535023 0.2471599 -0.0000259 0.3137463 -0.1340767 -0.0000021 -0.0002307 0.0000522 -0.1204341 0.1227161 -0.0028742 0.0000046 -0.1545383 -0.0613656 0.0000228 -0.0002108 -0.0000899 -0.1835142 -0.1147426 0.0484929 0.0001458 -0.0259033 0.16567 0.0000073 -0.0000065 -0.0001206 -0.1970348 0.1095768 0.0033873 -0.00001 0.0042705 0.0716849 0.0000257 -0.0000196 0.0000043 0.2303647 0.1252891 -0.0342968 -0.0000201 0.0016769 0.0555037 0.0000109 0.0000032 0.0000579 0.2100372 0.2357124 0.0116361 -0.0000422 0.0406164 0.2070722 -0.0000052 0.0000058 0.0000009 0.3502608 -0.0035453 0.0470346 -0.0000618 0.029543 0.0859327 0.0000588 0.0000024 0.0000845 0.2283583 unknown
polarizability: 90.5174172|1.1128048|72.9787069|-0.0125756|-0.0080307|25.328927 unknown
InChI: InChI=1S/C4H4N2O2/c7-6(8)4-1-2-5-3-4/h1-3,5H
charge 0 multiplicity 1
12 atoms
O  -2.083433 -1.159608 0.001412
O  -2.097898 1.132968 0.00108
N  2.062872 0.726936 -0.000103
N  -1.482706 -0.011019 -0.001434
C  -0.039689 -0.005225 -0.000828
C  0.74927 1.156299 -0.00055
C  0.813626 -1.161068 -0.000176
C  2.120472 -0.677058 0.000205
H  0.449367 2.200014 -0.000801
H  0.486199 -2.196997 -0.000149
H  2.873616 1.344121 0.000028
H  3.069204 -1.207862 0.000615
