program: Gaussian 09
title: 000145818
version: EM64L-G09RevD.01
frameworkgroup: C1[X(C12H15Cl2NO2)]
method: RPBEPBE
basis: SDD
operation: Freq
keyword: #p
keyword: freq=noraman
keyword: PBEPBE/SDD
title: #p freq=noraman PBEPBE/SDD
converged: YES YES NO NO
title: Mulliken charges:
elementType: Cl Cl O O N C C C C C C C C C C C C H H H H H H H H H H H H H H H
charge: -0.063702 -0.068798 -0.456817 -0.251658 -0.142025 0.497080 -0.415190 -0.421832 -0.492948 -0.371090 0.116467 0.372176 -0.556171 -0.553913 -0.444895 -0.786781 0.086129 0.233235 0.275282 0.241214 0.273875 0.278551 0.225683 0.287907 0.263237 0.294248 0.264348 0.231617 0.244457 0.211634 0.246169 0.382510
chargesum: 0.00000
title: Mulliken charges with hydrogens summed into heavy atoms:
elementType: Cl Cl O O N C C C C C C C C C C C C
charge: -0.063702 -0.068798 -0.074307 -0.251658 -0.142025 0.497080 0.093326 0.093257 -0.214397 -0.145407 0.116467 0.372176 -0.005027 0.004683 -0.213278 -0.084522 0.086129
polarizability: 2.25188969e+02 4.39335277e+00 1.46473464e+02 -2.74678092e+00 2.94241509e+01 1.31634077e+02
1716.lowfreq: -8.4026 -5.1932 -4.3713 0.0009 0.0014 0.0021 24.8623 32.7082 45.0688
frequency: 24.6308 32.5690 45.0480 50.1211 64.3486 84.5528 92.4281 126.7342 152.6440 165.9820 168.7914 191.1049 228.6981 287.5345 327.3982 349.8644 367.2220 377.9949 395.6669 427.9979 438.3236 494.3863 513.3741 531.4630 557.3212 599.1228 600.7046 604.8999 619.0732 665.3433 696.2177 740.2570 755.4940 811.4514 813.8340 869.1331 894.4691 909.5199 919.9840 944.7776 948.5572 986.6240 1003.9863 1005.7752 1035.7658 1042.7410 1050.1847 1117.3625 1160.2642 1172.2247 1181.2159 1185.8196 1229.1256 1237.9464 1263.4485 1291.9016 1292.9739 1307.8676 1311.8021 1351.7802 1361.3527 1372.6092 1390.9213 1407.3511 1422.8913 1439.3643 1440.3470 1454.8732 1463.0088 1465.4988 1491.0568 1512.4935 1560.6107 1620.8288 1644.2199 2969.7168 2974.6317 2987.0404 3053.3223 3056.8518 3070.3636 3072.5603 3079.0295 3085.6583 3127.2017 3141.7935 3146.2417 3160.9564 3194.2986 3531.3318
redmass: 9.6335 9.4541 9.5032 8.0726 6.6487 5.6479 3.5420 3.2940 3.4599 2.9637 1.2795 4.5858 6.3087 3.6048 3.7536 3.5091 3.4288 4.0334 3.9415 3.0762 3.1119 3.4280 2.2109 2.7909 2.6306 1.5459 4.0916 4.3211 4.5346 4.3755 3.1129 4.8394 4.8055 1.7318 2.5369 1.8320 1.5576 2.9883 1.8505 1.5121 1.8883 3.6247 1.6094 1.8177 3.0590 1.5367 1.6898 1.8682 1.1482 1.6094 1.5968 1.4244 2.3184 1.4419 1.5310 1.5544 1.3881 1.2223 1.7634 1.3815 1.4825 2.8025 2.1936 1.2210 3.1876 1.0983 1.1317 1.0454 1.1035 1.1552 1.1977 2.8077 5.9805 6.6941 7.5634 1.0691 1.0692 1.0364 1.0580 1.0585 1.0962 1.0926 1.0922 1.1010 1.0884 1.1101 1.1100 1.0938 1.0900 1.0641
irintensity: 0.6449 0.4410 0.7266 0.7865 5.6279 3.4342 2.4496 2.2833 0.5003 1.8865 0.6969 1.8721 1.7150 5.8994 1.1366 1.2193 2.0065 4.2006 0.9338 7.2151 12.8814 19.8261 2.8682 6.0547 33.2804 101.2838 19.7273 31.7479 37.3723 2.4154 9.4050 1.7797 18.8324 25.4614 15.0771 0.4498 19.7833 25.1318 48.7100 1.2715 6.4920 209.7227 8.2515 4.9901 13.9184 8.1469 1.4584 152.4539 7.7672 7.6349 2.7543 67.1674 23.6612 41.1127 8.7437 17.8003 6.7923 45.6703 29.3943 45.0999 124.0478 7.4992 28.9097 17.8246 30.3732 0.4727 14.8415 12.3900 26.3539 21.6556 3.3837 178.7305 56.7426 387.2765 68.9883 37.0088 16.6635 29.6523 20.4525 13.8700 11.8003 1.6284 8.1143 23.7762 20.2510 19.7895 16.7418 21.0436 7.2457 40.9553
temp: 298.150 k
press: 1.00000 atm
elementType: 17 17 8 8 7 6 6 6 6 6 6 6 6 6 6 6 6 1 1 1 1 1 1 1 1 1 1 1 1 1 1 1
symmnumber: 1
zpe: 656847.2 jmol-1
zpe.correction: 0.250180 hartree
zpe.thermalcorrener: 0.267976 hartree
zpe.thermalcorrenthalpy: 0.268920 hartree
zpe.thermalcorrgfe: 0.201670 hartree
zpe.sumelectzpe: -1590.326491 hartree
zpe.sumelectthermal: -1590.308695 hartree
zpe.sumelectthermalent: -1590.307750 hartree
zpe.sumelectthermalfe: -1590.375001 hartree
dipole: 1.0897 -0.5703 -0.5001
dipole: 1.3277
quadrupole: -130.4677 -108.2046 -114.1857
quadrupole: -4.0040 -2.7061 15.8506
quadrupole: -12.8484 9.4148 3.4336 -4.0040 -2.7061 15.8506
hfenergy: -1590.5766708 hartree
pointgroup: C01 [X(C12H15Cl2N1O2)]
dipole: 0.440995 0.2342049 0.1533335 debye
polarizability: 224.9167734|-0.244653|147.0713905|-6.5486507|29.4279766|131.3083456 unknown
InChI: InChI=1S/C12H15Cl2NO2/c1-9-2-3-10(8-11(9)12(16)17)15(6-4-13)7-5-14/h2-3,8,16H,4-7H2,1H3
charge 0 multiplicity 1
32 atoms
Cl 3.822461 1.821201 -1.993263
Cl 3.484506 -2.735389 1.005406
O  -2.482135 -2.088364 -1.341955
O  -4.243473 -0.908607 -0.419118
N  1.836623 -0.036119 -0.056709
C  0.49901 0.271468 0.259363
C  2.943955 0.763989 0.481595
C  2.162899 -1.162496 -0.941771
C  -0.583942 -0.487917 -0.264129
C  0.157455 1.360055 1.121947
C  -1.935461 -0.184772 0.044004
C  -2.274444 0.90623 0.906895
C  3.179543 2.103274 -0.233796
C  2.098287 -2.544182 -0.274142
C  -1.185175 1.650049 1.424571
C  -3.691156 1.293059 1.285059
C  -3.000288 -1.035989 -0.551204
H  2.772159 0.981289 1.556364
H  3.866068 0.160925 0.443349
H  1.475133 -1.175803 -1.812581
H  3.170749 -1.002508 -1.359131
H  -0.411039 -1.336151 -0.927185
H  0.93326 1.989493 1.567216
H  2.259132 2.691401 -0.358256
H  3.961223 2.69601 0.267016
H  1.167641 -2.707671 0.287096
H  2.265325 -3.352932 -1.002586
H  -1.399502 2.49394 2.090883
H  -4.225619 0.463128 1.780395
H  -3.678144 2.162043 1.965793
H  -4.29842 1.545685 0.398046
H  -3.25273 -2.60244 -1.703973
