program: Gaussian 09
title: 000145793
version: EM64L-G09RevD.01
frameworkgroup: C1[X(C12H14N2O)]
method: RPBEPBE
basis: SDD
operation: Freq
keyword: #p
keyword: freq=noraman
keyword: PBEPBE/SDD
title: #p freq=noraman PBEPBE/SDD
converged: YES YES NO NO
title: Mulliken charges:
elementType: O N N C C C C C C C C C C C C H H H H H H H H H H H H H H
charge: -0.314210 -0.196157 -0.413871 -0.031580 -0.469431 -0.458802 -0.351798 -0.462543 0.173781 0.074675 0.377592 -0.317055 -0.440410 -0.282905 -0.210201 0.254366 0.230317 0.216357 0.228998 0.223995 0.230382 0.260772 0.216198 0.232816 0.294425 0.277851 0.203794 0.228679 0.223966
chargesum: 0.00000
title: Mulliken charges with hydrogens summed into heavy atoms:
elementType: O N N C C C C C C C C C C C C
charge: -0.314210 -0.196157 -0.119446 0.222785 -0.022757 -0.005809 0.139356 -0.013529 0.173781 0.074675 0.377592 -0.039204 -0.236616 -0.054226 0.013765
polarizability: 1.98292842e+02 5.17041189e+00 1.52408674e+02 7.74729576e+00 -2.73142543e-02 8.08793846e+01
1716.lowfreq: -0.0009 -0.0005 -0.0004 3.3248 8.5967 12.8736 43.8313 75.0615 119.8892
frequency: 43.7689 75.0552 119.8861 156.1617 191.3941 239.2885 255.4324 265.1781 307.1042 335.2044 389.5182 397.9320 441.7333 448.8631 521.2109 532.1861 561.3795 580.3999 614.4834 640.4192 680.8019 706.7904 752.7255 766.8230 820.0372 853.5108 858.0339 880.9342 886.1998 926.9165 945.8349 960.2886 984.6439 992.0732 1036.2160 1042.1786 1083.0399 1106.1584 1112.2598 1119.7634 1143.0214 1173.1159 1174.0972 1178.2737 1194.3272 1228.7839 1245.4107 1266.1276 1279.8660 1291.9640 1310.3536 1320.2852 1328.8187 1338.6423 1354.4827 1375.6009 1403.7426 1415.2232 1457.7569 1466.7693 1476.3152 1487.4731 1495.8449 1509.3615 1527.1812 1582.3991 1620.9216 2937.7316 2972.3999 2984.1078 2990.6487 3011.9277 3039.8874 3070.7185 3071.8127 3088.2496 3101.8809 3135.8417 3152.0589 3170.3135 3568.8971
redmass: 3.6979 3.6179 4.8544 3.2175 2.4289 3.1957 3.1033 2.8890 3.9262 5.7987 6.0126 1.2236 3.6551 3.6249 4.9560 3.6482 2.2768 3.9601 3.4039 5.6524 4.1718 3.3138 2.6458 1.7217 4.1000 1.5348 1.8846 3.8754 1.5801 1.9727 2.0486 1.3448 2.3430 1.3397 2.0158 2.7199 2.8740 2.4607 2.3162 2.1513 1.4811 1.6105 1.2832 1.9584 1.8600 1.3365 1.4022 1.6018 1.2947 1.7312 1.3725 1.3411 1.3135 1.6099 1.7222 2.8892 4.6250 2.1694 1.2153 1.0996 1.0967 2.0525 1.0923 2.3270 5.1370 5.2924 6.2074 1.0680 1.0839 1.0684 1.0653 1.0631 1.0948 1.0955 1.0984 1.1045 1.0876 1.0896 1.0918 1.0993 1.0768
irintensity: 1.5427 1.7890 0.8507 1.2666 4.8294 0.4047 0.1972 1.5552 4.3799 14.0560 10.4775 84.8476 0.4644 2.5372 0.9166 5.9138 1.0019 4.5683 3.4183 5.4774 19.0180 1.6349 56.6275 42.5000 4.3016 1.4556 7.6225 11.4300 3.5246 5.8195 0.1656 1.9730 2.1311 2.2457 3.8502 9.9164 5.5416 6.3761 9.6580 22.5068 14.2399 6.4052 21.7270 7.2021 5.5976 13.4428 6.1546 19.5933 2.0511 4.8705 1.5181 0.9652 4.0788 7.8361 197.6080 134.3263 17.6581 34.3894 29.3636 6.4166 6.8017 30.3013 7.0309 57.0891 278.8972 53.8617 117.7989 59.9221 33.5639 30.2140 44.2434 32.6889 28.6851 14.2008 38.3636 51.6474 17.1249 19.2133 7.3415 27.3266 25.6105
temp: 298.150 k
press: 1.00000 atm
elementType: 8 7 7 6 6 6 6 6 6 6 6 6 6 6 6 1 1 1 1 1 1 1 1 1 1 1 1 1 1
symmnumber: 1
zpe: 631475.5 jmol-1
zpe.correction: 0.240516 hartree
zpe.thermalcorrener: 0.252719 hartree
zpe.thermalcorrenthalpy: 0.253663 hartree
zpe.thermalcorrgfe: 0.202099 hartree
zpe.sumelectzpe: -649.324846 hartree
zpe.sumelectthermal: -649.312644 hartree
zpe.sumelectthermalent: -649.311700 hartree
zpe.sumelectthermalfe: -649.363263 hartree
dipole: -2.4052 -5.5904 0.8342
dipole: 6.1428
quadrupole: -75.1846 -87.1110 -91.4441
quadrupole: -0.0831 0.5700 3.9343
quadrupole: 9.3953 -2.5311 -6.8642 -0.0831 0.5700 3.9343
hfenergy: -649.5653626 hartree
pointgroup: C01 [X(C12H14N2O1)]
dipole: -0.9641365 -2.1982663 0.2806314 debye
polarizability: 198.5135034|4.5612887|152.2755485|6.83291|1.6843805|80.7918481 unknown
InChI: InChI=1S/C12H14N2O/c15-12-10-5-1-2-6-11(10)13-8-9-4-3-7-14(9)12/h1-2,5-6,9,13H,3-4,7-8H2
charge 0 multiplicity 1
29 atoms
O  -0.340043 2.417456 -0.446508
N  -1.504115 0.508836 0.054205
N  0.435426 -1.978456 -0.308107
C  -1.723596 -0.921983 0.373444
C  -3.264474 -1.072759 0.278053
C  -3.80563 0.332815 0.633151
C  -2.774274 1.282309 -0.014717
C  -0.981583 -1.846018 -0.618399
C  -0.303925 1.165927 -0.172481
C  1.031053 0.464197 -0.033764
C  1.345019 -0.94012 -0.087304
C  2.112833 1.377722 0.156876
C  2.710086 -1.343103 0.085942
C  3.44321 0.969259 0.326177
C  3.739132 -0.417272 0.294769
H  -1.367384 -1.151542 1.398583
H  -3.638827 -1.869211 0.94337
H  -3.544452 -1.334313 -0.761652
H  -4.827741 0.506681 0.256906
H  -3.814603 0.473169 1.729582
H  -3.024915 1.515225 -1.068732
H  -2.6541 2.244913 0.508911
H  -1.42674 -2.857188 -0.570196
H  -1.154731 -1.450585 -1.643055
H  0.832428 -2.9164 -0.336828
H  1.846992 2.439507 0.156401
H  2.945347 -2.41526 0.043632
H  4.235269 1.708719 0.479216
H  4.768437 -0.771224 0.423425
